{"text_format":"3","workbook":"xlsx","n_sheets":7,"sheets":["内訳欄（１）","内訳欄（２）-1","内訳欄（２）-2","内訳欄（２）-3","内訳欄（２）-4","内訳欄（２）-5","リスト"],"not_rendered":{"defined_names":18,"comments":1},"read":"whole","date_system":"1900"}

{"sheet":"内訳欄（１）","index":0,"n_rows":130,"n_cols":93,"rows_kept":130,"merged":[[0,82,1,84],[0,85,1,90],[1,27,2,54],[3,69,4,74],[3,75,4,77],[3,78,4,81],[3,82,4,84],[3,85,4,88],[3,89,4,90],[3,91,4,91],[4,33,5,50],[5,70,5,90],[6,0,7,34],[6,64,6,90],[8,0,8,45],[8,84,8,90],[9,4,9,15],[9,16,9,32],[9,33,9,45],[9,46,9,86],[10,4,10,15],[10,16,10,18],[10,19,10,48],[10,49,10,60],[10,61,10,86],[11,4,11,15],[11,16,11,86],[12,4,12,15],[12,16,12,86],[13,4,13,15],[13,16,13,53],[13,54,13,60],[13,61,13,86],[14,4,14,15],[14,16,14,22],[14,23,14,27],[14,28,14,86],[16,0,21,90],[23,18,24,30],[23,31,24,53],[24,0,24,17],[26,0,26,7],[26,8,26,46],[26,47,26,49],[26,50,26,54],[26,55,26,62],[26,63,26,67],[26,68,26,76],[26,77,26,90],[27,0,27,3],[27,4,27,7],[27,8,27,46],[27,47,27,49],[27,50,27,54],[27,55,27,62],[27,63,27,67],[27,68,27,75],[27,77,27,90],[28,0,28,3],[28,4,28,7],[28,8,28,46],[28,47,28,49],[28,50,28,54],[28,55,28,62],[28,63,28,67],[28,68,28,75],[28,77,28,90],[29,0,29,3],[29,4,29,7],[29,8,29,46],[29,47,29,49],[29,50,29,54],[29,55,29,62],[29,63,29,67],[29,68,29,75],[29,77,29,90],[30,0,30,3],[30,4,30,7],[30,8,30,46],[30,47,30,49],[30,50,30,54],[30,55,30,62],[30,63,30,67],[30,68,30,75],[30,77,30,90],[31,0,31,3],[31,4,31,7],[31,8,31,46],[31,47,31,49],[31,50,31,54],[31,55,31,62],[31,63,31,67],[31,68,31,75],[31,77,31,90],[32,0,32,3],[32,4,32,7],[32,8,32,46],[32,47,32,49],[32,50,32,54],[32,55,32,62],[32,63,32,67],[32,68,32,75],[32,77,32,90],[33,0,33,3],[33,4,33,7],[33,8,33,46],[33,47,33,49],[33,50,33,54],[33,55,33,62],[33,63,33,67],[33,68,33,75],[33,77,33,90],[34,0,35,26],[34,63,34,76],[34,77,34,90],[35,63,35,76],[35,77,35,90],[36,63,36,76],[36,77,36,90],[37,33,37,46],[37,63,37,76],[37,77,37,90],[38,0,38,23],[38,33,38,46],[38,47,38,62],[38,63,38,76],[38,77,38,90],[39,0,39,23],[39,33,39,46],[39,47,39,62],[39,63,39,76],[39,77,39,90],[40,33,40,62],[40,63,40,90],[42,82,43,84],[42,85,43,90],[43,27,44,54],[45,64,46,68],[45,69,46,74],[45,75,46,77],[45,78,46,81],[45,82,46,84],[45,85,46,88],[45,89,46,90],[46,36,47,40],[46,53,47,57],[47,75,47,77],[47,82,47,84],[47,89,47,90],[49,0,50,34],[49,37,49,39],[49,54,49,56],[49,69,49,90],[51,37,51,39],[51,54,51,56],[52,4,52,15],[52,16,52,32],[52,33,52,45],[52,46,52,86],[53,4,53,15],[53,16,53,18],[53,19,53,48],[53,49,53,58],[53,59,53,60],[53,62,53,86],[54,4,54,15],[54,16,54,86],[55,4,55,15],[55,16,55,86],[56,4,56,15],[56,16,56,53],[56,54,56,60],[56,61,56,86],[57,4,57,15],[57,16,57,22],[57,23,57,27],[57,28,57,86],[59,0,59,20],[59,21,59,45],[59,46,59,67],[59,68,59,90],[60,0,60,20],[60,21,60,29],[60,30,60,37],[60,38,60,45],[60,46,60,67],[60,68,60,75],[60,76,60,83],[60,84,60,90],[61,0,61,20],[61,21,61,29],[61,30,61,37],[61,38,61,45],[61,46,61,67],[61,68,61,75],[61,76,61,83],[61,84,61,90],[62,0,62,20],[62,21,62,29],[62,30,62,37],[62,38,62,45],[62,46,62,67],[62,68,62,75],[62,76,62,83],[62,84,62,90],[64,0,64,20],[64,21,64,29],[64,30,64,37],[64,38,64,45],[64,46,64,67],[64,68,64,75],[64,76,64,83],[64,84,64,90],[65,0,65,20],[65,21,65,29],[65,30,65,37],[65,38,65,45],[65,46,65,67],[65,68,65,75],[65,76,65,83],[65,84,65,90],[66,0,66,20],[66,21,66,29],[66,30,66,37],[66,38,66,45],[66,46,66,67],[66,68,66,75],[66,76,66,83],[66,84,66,90],[67,0,67,20],[67,21,67,29],[67,30,67,37],[67,38,67,45],[67,46,67,67],[67,68,67,75],[67,76,67,83],[67,84,67,90],[69,18,70,30],[69,31,70,53],[70,0,70,17],[72,0,72,7],[72,8,72,46],[72,47,72,49],[72,50,72,54],[72,55,72,62],[72,63,72,67],[72,68,72,76],[72,77,72,90],[73,0,73,3],[73,4,73,7],[73,8,73,46],[73,47,73,49],[73,50,73,54],[73,55,73,62],[73,63,73,67],[73,68,73,75],[73,77,73,90],[74,0,74,3],[74,4,74,7],[74,8,74,46],[74,47,74,49],[74,50,74,54],[74,55,74,62],[74,63,74,67],[74,68,74,75],[74,77,74,90],[75,0,75,3],[75,4,75,7],[75,8,75,46],[75,47,75,49],[75,50,75,54],[75,55,75,62],[75,63,75,67],[75,68,75,75],[75,77,75,90],[76,0,76,3],[76,4,76,7],[76,8,76,46],[76,47,76,49],[76,50,76,54],[76,55,76,62],[76,63,76,67],[76,68,76,75],[76,77,76,90],[77,0,77,3],[77,4,77,7],[77,8,77,46],[77,47,77,49],[77,50,77,54],[77,55,77,62],[77,63,77,67],[77,68,77,75],[77,77,77,90],[78,0,78,3],[78,4,78,7],[78,8,78,46],[78,47,78,49],[78,50,78,54],[78,55,78,62],[78,63,78,67],[78,68,78,75],[78,77,78,90],[79,0,79,3],[79,4,79,7],[79,8,79,46],[79,47,79,49],[79,50,79,54],[79,55,79,62],[79,63,79,67],[79,68,79,75],[79,77,79,90],[80,0,81,26],[80,63,80,76],[80,77,80,90],[81,63,81,76],[81,77,81,90],[82,63,82,76],[82,77,82,90],[83,33,83,46],[83,63,83,76],[83,77,83,90],[84,0,84,23],[84,33,84,46],[84,47,84,62],[84,63,84,76],[84,77,84,90],[85,0,85,23],[85,33,85,46],[85,47,85,62],[85,63,85,76],[85,77,85,90],[86,33,86,62],[86,63,86,90],[88,82,89,84],[88,85,89,90],[89,27,90,54],[91,64,92,68],[91,69,92,74],[91,75,92,77],[91,78,92,81],[91,82,92,84],[91,85,92,88],[91,89,92,90],[92,36,93,40],[92,53,93,57],[93,75,93,77],[93,82,93,84],[93,89,93,90],[95,0,96,34],[95,37,95,39],[95,54,95,56],[95,69,95,90],[97,37,97,39],[97,54,97,56],[98,4,98,15],[98,16,98,32],[98,33,98,45],[98,46,98,86],[99,4,99,15],[99,16,99,18],[99,19,99,48],[99,49,99,58],[99,59,99,60],[99,62,99,86],[100,4,100,15],[100,16,100,86],[101,4,101,15],[101,16,101,86],[102,4,102,15],[102,16,102,53],[102,54,102,60],[102,61,102,86],[103,4,103,15],[103,16,103,22],[103,23,103,27],[103,28,103,86],[105,0,105,20],[105,21,105,45],[105,46,105,67],[105,68,105,90],[106,0,106,20],[106,21,106,29],[106,30,106,37],[106,38,106,45],[106,46,106,67],[106,68,106,75],[106,76,106,83],[106,84,106,90],[107,0,107,20],[107,21,107,29],[107,30,107,37],[107,38,107,45],[107,46,107,67],[107,68,107,75],[107,76,107,83],[107,84,107,90],[108,0,108,20],[108,21,108,29],[108,30,108,37],[108,38,108,45],[108,46,108,67],[108,68,108,75],[108,76,108,83],[108,84,108,90],[109,0,109,20],[109,21,109,29],[109,30,109,37],[109,38,109,45],[109,46,109,67],[109,68,109,75],[109,76,109,83],[109,84,109,90],[110,0,110,20],[110,21,110,29],[110,30,110,37],[110,38,110,45],[110,46,110,67],[110,68,110,75],[110,76,110,83],[110,84,110,90],[112,18,113,30],[112,31,113,53],[113,0,113,17],[115,0,115,7],[115,8,115,46],[115,47,115,49],[115,50,115,54],[115,55,115,62],[115,63,115,67],[115,68,115,76],[115,77,115,90],[116,0,116,3],[116,4,116,7],[116,8,116,46],[116,47,116,49],[116,50,116,54],[116,55,116,62],[116,63,116,67],[116,68,116,75],[116,77,116,90],[117,0,117,3],[117,4,117,7],[117,8,117,46],[117,47,117,49],[117,50,117,54],[117,55,117,62],[117,63,117,67],[117,68,117,75],[117,77,117,90],[118,0,118,3],[118,4,118,7],[118,8,118,46],[118,47,118,49],[118,50,118,54],[118,55,118,62],[118,63,118,67],[118,68,118,75],[118,77,118,90],[119,0,119,3],[119,4,119,7],[119,8,119,46],[119,47,119,49],[119,50,119,54],[119,55,119,62],[119,63,119,67],[119,68,119,75],[119,77,119,90],[120,0,120,3],[120,4,120,7],[120,8,120,46],[120,47,120,49],[120,50,120,54],[120,55,120,62],[120,63,120,67],[120,68,120,75],[120,77,120,90],[121,0,121,3],[121,4,121,7],[121,8,121,46],[121,47,121,49],[121,50,121,54],[121,55,121,62],[121,63,121,67],[121,68,121,75],[121,77,121,90],[122,0,122,3],[122,4,122,7],[122,8,122,46],[122,47,122,49],[122,50,122,54],[122,55,122,62],[122,63,122,67],[122,68,122,75],[122,77,122,90],[123,0,124,26],[123,63,123,76],[123,77,123,90],[124,63,124,76],[124,77,124,90],[125,63,125,76],[125,77,125,90],[126,33,126,46],[126,63,126,76],[126,77,126,90],[127,0,127,23],[127,33,127,46],[127,47,127,62],[127,63,127,76],[127,77,127,90],[128,0,128,23],[128,33,128,46],[128,47,128,62],[128,63,128,76],[128,77,128,90],[129,33,129,62],[129,63,129,90]]}
[{"$nulls":82},"No."]
[{"$nulls":27},"請 　 求  　書"]
[]
[{"$nulls":75},"年",{"$nulls":6},"月",{"$nulls":6},"日"]
[]
[{"$nulls":70},{"$f":"IF(OR(AND(CA4=6,CH4<>20,CH4<>30),AND(CA4=12,CH4<>15,CH4<>20),AND(CA4=1,CH4<>20),AND(CA4=2,CH4<>20),AND(CA4=3,CH4<>20),AND(CA4=4,CH4<>20),AND(CA4=5,CH4<>20),AND(CA4=7,CH4<>20),AND(CA4=8,CH4<>20),AND(CA4=9,CH4<>20,TRUE),AND(CA4=10,CH4<>20),AND(CA4=11,CH4<>20)),\"締日を選択してください\",\"\")","v":""},{"$nulls":20},{"$f":"\"月\"&CA4","v":"月"}]
["酒井鈴木工業㈱ 御中",{"$nulls":63},"①取引先控",{"$nulls":27}," "]
[]
[]
[{"$nulls":4},"工事番号",{"$nulls":28},"工 事 名"]
[{"$nulls":4},"郵便番号",{"$nulls":11},"〒",{"$nulls":32},"登録番号：Ｔ"]
[{"$nulls":4},"住所"]
[{"$nulls":4},"社名",{"$nulls":11},"社名を入力してください"]
[{"$nulls":4},"代表者名",{"$nulls":49},"ＴＥＬ"]
[{"$nulls":4},"今回請求額\n(消費税込み)",{"$nulls":18},"￥",{"$nulls":4},{"$f":"BL41","v":{"v":0,"d":"0-"}}]
[]
["　　　　　　　　　　    　　請求書について\n１. 本請求書は、３枚１組です。①の必要事項全てに入力してください。②～③を\n　　提出いただき「①取引先控」は貴社にて保管ください。\n　　内訳欄(1)に入力しきれない場合は、内訳欄(2)-1～5に続けて入力してください。\n　　内訳欄(2)-1～5も３枚１組です。\n２. 請求書の締切日は毎月20日とし毎月25日まで各現場担当者に必着するよう\n　　送付又は持参願います。ただし、12月は15日締切20日必着です。\n３. 総括表は、本社へ必ず提出してください。工事番号は注文書に記載されていま\n　　す。不明な点は工事担当者へお問い合わせください。\n４. 工事別に請求書を作成してください。１工事につき１組提出してください。\n５．取引先コードを入力してください。"]
[]
[]
[]
[]
[]
[]
[{"$nulls":18},"取引先コード"]
["内 訳 欄(１)"]
[{"$nulls":87},"　　　　　　　　　　　　請求書記入の手引き\n１. 本請求書は、①～④までの4枚1組の複写式です。責社では、①の全てに必要事\n　　項を記入してください。\n　　内訳欄(1)に書ききれない場合は、内訳欄(2)にひき続き:己入してください.\n　　内訳欄(2)も4枚1組です。\n２. 請求書の締明日は毎月20日とし毎月25日まで各現場担当者に必着するよう送付\n　　又は持参願います。\n　　ただし、12月は15日締切20+43:57日必着です。\n３. 総括表は、本社へ必ず提出してください。\n４. 工事別に請求書を作成してください。\n５．取引先コードを記入してください。"]
["月 日",{"$nulls":7},"内　　　　　　　　　訳",{"$nulls":38},"税率\n区分",null,null,"科目",{"$nulls":4},"数 量",{"$nulls":7},"単位",{"$nulls":4},"単 価",{"$nulls":8},"金　　額"]
[{"$nulls":77},{"$f":"ROUND(BD28*BQ28,0)","v":{"v":0,"d":"0 "}}]
[{"$nulls":77},{"v":0,"d":"0 "}]
[{"$nulls":77},{"$f":"ROUND(BD30*BQ30,0)","v":{"v":0,"d":"0 "}}]
[{"$nulls":77},{"v":0,"d":"0 "}]
[{"$nulls":77},{"v":0,"d":"0 "}]
[{"$nulls":77},{"v":0,"d":"0 "}]
[{"$nulls":77},{"$f":"ROUND(BD34*BQ34,0)","v":{"v":0,"d":"0 "}}]
["※は軽減税率対象項目\n０ は非課税、不課税対象項目",{"$nulls":62},"非・不課税 対象小計",{"$nulls":13},{"$f":"SUMIF($AV$28:$AX$34,\"0\",$BZ$28:$CM$34)","v":{"v":0,"d":"0 "}}]
[{"$nulls":63},"8% 対象小計",{"$nulls":13},{"$f":"SUMIF($AV$28:$AX$34,\"※\",$BZ$28:$CM$34)","v":{"v":0,"d":"0 "}}]
[{"$nulls":63},"10% 対象小計",{"$nulls":13},{"$f":"SUMIF($AV$28:$AX$34,\"\",$BZ$28:$CM$34)","v":{"v":0,"d":"0 "}}]
[{"$nulls":63},"非・不課税 対象合計",{"$nulls":13},{"$f":"BZ35+'内訳欄（２）-1'!K27+'内訳欄（２）-2'!K27+'内訳欄（２）-3'!K27+'内訳欄（２）-4'!K27+'内訳欄（２）-5'!K27","v":{"v":0,"d":"0 "}}]
["酒井鈴木工業工事担当者",{"$nulls":32},"8%税額",{"$nulls":29},"8% 対象合計",{"$nulls":13},{"$f":"BZ36+'内訳欄（２）-1'!K28+'内訳欄（２）-2'!K28+'内訳欄（２）-3'!K28+'内訳欄（２）-4'!K28+'内訳欄（２）-5'!K28","v":{"v":0,"d":"0 "}}]
[{"$nulls":33},"10%税額",{"$nulls":29},"10% 対象合計",{"$nulls":13},{"$f":"BZ37+'内訳欄（２）-1'!K29+'内訳欄（２）-2'!K29+'内訳欄（２）-3'!K29+'内訳欄（２）-4'!K29+'内訳欄（２）-5'!K29","v":{"v":0,"d":"0 "}}]
[{"$nulls":33},"請 求 合 計 金 額（税込）",{"$nulls":29},{"$f":"IF(OR(AND(BZ39>0,AV39=0),AND(BZ39<0,AV39=0),AND(BZ40>0,AV40=0),AND(BZ40<0,AV40=0)),\"\",BZ38+(BZ39+AV39)+(BZ40+AV40))","v":{"v":0,"d":"0 "}}]
[]
[{"$nulls":82},"No.",null,null,{"$f":"$CH$1","v":0}]
[{"$nulls":27},"請 　 求  　書"]
[]
[{"$nulls":64},{"$f":"'内訳欄（１）'!$BM$4","v":0},{"$nulls":4},{"$f":"$BR$4","v":0},{"$nulls":5},"年",null,null,{"$f":"$CA$4","v":0},{"$nulls":3},"月",null,null,{"$f":"$CH$4","v":0},{"$nulls":3},"日"]
[{"$nulls":36},"工事",{"$nulls":16},"一般"]
[]
[]
["酒井鈴木工業㈱ 御中",{"$nulls":36},"税",{"$nulls":16},"税",{"$nulls":14},"②提出用(経理)"]
[]
[{"$nulls":37},"計",{"$nulls":16},"計"]
[{"$nulls":4},"工事番号",{"$nulls":11},{"$f":"Q10","v":0},{"$nulls":16},"工 事 名",{"$nulls":12},{"$f":"AU10","v":0}]
[{"$nulls":4},"郵便番号",{"$nulls":11},"〒",null,null,{"$f":"T11","v":0},{"$nulls":29},"登録番号",{"$nulls":9},"T",null,null,{"$f":"BJ11","v":0}]
[{"$nulls":4},"住所",{"$nulls":11},{"$f":"Q12","v":0}]
[{"$nulls":4},"社名",{"$nulls":11},{"$f":"IF(Q13=\"社名を入力してください\",\"\",Q13)","v":""}]
[{"$nulls":4},"代表者名",{"$nulls":11},{"$f":"Q14","v":{"v":0,"d":"0 "}},{"$nulls":37},"ＴＥＬ",{"$nulls":6},{"$f":"BJ14","v":0}]
[{"$nulls":4},"今回請求額\n(消費税込み)",{"$nulls":18},"￥",{"$nulls":4},{"$f":"$AC$15","v":{"v":0,"d":"0-"}}]
[]
["科　　　目",{"$nulls":20},"金　　　額",{"$nulls":24},"科　　　目",{"$nulls":21},"金　　　額"]
[]
[]
[]
[]
[]
[]
["消　費　税"]
["合　　　計"]
[]
[{"$nulls":18},"取引先コード",{"$nulls":12},{"$f":"$AF$24","v":0}]
["内 訳 欄(１)"]
[]
["月 日",{"$nulls":7},"内　　　　　　　　　訳",{"$nulls":38},"税率\n区分",null,null,"科目",{"$nulls":4},"数 量",{"$nulls":7},"単位",{"$nulls":4},"単 価",{"$nulls":8},"金　　額"]
[{"$f":"$A28","v":0},{"$nulls":3},{"$f":"$E28","v":0},{"$nulls":3},{"$f":"I28","v":0},{"$nulls":38},{"$f":"AV28","v":0},null,null,{"$f":"AY28","v":0},{"$nulls":4},{"$f":"$BD$28","v":{"v":0,"d":"0."}},{"$nulls":7},{"$f":"$BL28","v":0},{"$nulls":4},{"$f":"$BQ28","v":{"v":0,"d":"0."}},{"$nulls":8},{"$f":"$BZ28","v":{"v":0,"d":"0 "}}]
[0,{"$nulls":3},0,{"$nulls":3},0,{"$nulls":38},0,null,null,0,{"$nulls":4},{"$f":"$BD29","v":{"v":0,"d":"0."}},{"$nulls":7},0,{"$nulls":4},{"v":0,"d":"0."},{"$nulls":8},{"v":0,"d":"0 "}]
[0,{"$nulls":3},0,{"$nulls":3},0,{"$nulls":38},0,null,null,0,{"$nulls":4},{"v":0,"d":"0."},{"$nulls":7},0,{"$nulls":4},{"v":0,"d":"0."},{"$nulls":7},{"v":250000,"d":"250,000 "},{"v":0,"d":"0 "}]
[0,{"$nulls":3},0,{"$nulls":3},0,{"$nulls":38},0,null,null,0,{"$nulls":4},{"v":0,"d":"0."},{"$nulls":7},0,{"$nulls":4},{"v":0,"d":"0."},{"$nulls":8},{"v":0,"d":"0 "}]
[0,{"$nulls":3},0,{"$nulls":3},0,{"$nulls":38},0,null,null,0,{"$nulls":4},{"v":0,"d":"0."},{"$nulls":7},0,{"$nulls":4},{"v":0,"d":"0."},{"$nulls":8},{"v":0,"d":"0 "}]
[0,{"$nulls":3},0,{"$nulls":3},0,{"$nulls":38},0,null,null,0,{"$nulls":4},{"v":0,"d":"0."},{"$nulls":7},0,{"$nulls":4},{"v":0,"d":"0."},{"$nulls":8},{"v":0,"d":"0 "}]
[0,{"$nulls":3},0,{"$nulls":3},0,{"$nulls":38},0,null,null,0,{"$nulls":4},{"v":0,"d":"0."},{"$nulls":7},0,{"$nulls":4},{"v":0,"d":"0."},{"$nulls":7},{"v":250000,"d":"250,000 "},{"v":0,"d":"0 "}]
["※は軽減税率対象項目\n０ は非課税、不課税対象項目",{"$nulls":62},"非・不課税 対象小計",{"$nulls":13},{"$f":"$BZ$35","v":{"v":0,"d":"0 "}}]
[{"$nulls":63},"8% 対象小計",{"$nulls":13},{"$f":"$BZ$36","v":{"v":0,"d":"0 "}}]
[{"$nulls":63},"10% 対象小計",{"$nulls":13},{"$f":"$BZ$37","v":{"v":0,"d":"0 "}}]
[{"$nulls":63},"非・不課税 対象合計",{"$nulls":13},{"$f":"$BZ$38","v":{"v":0,"d":"0 "}}]
["酒井鈴木工業工事担当者",{"$nulls":32},"8%税額",{"$nulls":13},{"$f":"$AV$39","v":{"v":0,"d":"0 "}},{"$nulls":15},"8% 対象合計",{"$nulls":13},{"$f":"$BZ$39","v":{"v":0,"d":"0 "}}]
[{"$f":"$A$40","v":0},{"$nulls":32},"10%税額",{"$nulls":13},{"$f":"$AV$40","v":{"v":0,"d":"0 "}},{"$nulls":15},"10% 対象合計",{"$nulls":13},{"$f":"$BZ$40","v":{"v":0,"d":"0 "}}]
[{"$nulls":33},"請 求 合 計 金 額（税込）",{"$nulls":29},{"$f":"$BL$41","v":{"v":0,"d":"0 "}}]
[]
[{"$nulls":82},"No.",null,null,{"$f":"$CH$1","v":0}]
[{"$nulls":27},"請 　 求  　書"]
[]
[{"$nulls":64},{"$f":"'内訳欄（１）'!$BM$4","v":0},{"$nulls":4},{"$f":"$BR$4","v":0},{"$nulls":5},"年",null,null,{"$f":"$CA$4","v":0},{"$nulls":3},"月",null,null,{"$f":"$CH$4","v":0},{"$nulls":3},"日"]
[]
[]
[]
["酒井鈴木工業㈱ 御中",{"$nulls":68},"③提出用(担当者控)"]
[]
[]
[{"$nulls":4},"工事番号",{"$nulls":11},{"$f":"Q10","v":0},{"$nulls":16},"工 事 名",{"$nulls":12},{"$f":"AU10","v":0}]
[{"$nulls":4},"郵便番号",{"$nulls":11},"〒",null,null,{"$f":"T11","v":0},{"$nulls":29},"登録番号",{"$nulls":9},"T",null,null,{"$f":"BK54","v":0}]
[{"$nulls":4},"住所",{"$nulls":11},{"$f":"Q12","v":0}]
[{"$nulls":4},"社名",{"$nulls":11},{"$f":"IF(Q13=\"社名を入力してください\",\"\",Q13)","v":""}]
[{"$nulls":4},"代表者名",{"$nulls":11},{"$f":"Q14","v":{"v":0,"d":"0 "}},{"$nulls":37},"ＴＥＬ",{"$nulls":6},{"$f":"BJ14","v":0}]
[{"$nulls":4},"今回請求額\n(消費税込み)",{"$nulls":18},"￥",{"$nulls":4},{"$f":"$AC$15","v":{"v":0,"d":"0-"}}]
{"$rows_empty":8}
[{"$nulls":18},"取引先コード",{"$nulls":12},{"$f":"$AF$24","v":0}]
["内 訳 欄(１)"]
[]
["月 日",{"$nulls":7},"内　　　　　　　　　訳",{"$nulls":38},"税率\n区分",null,null,"科目",{"$nulls":4},"数 量",{"$nulls":7},"単位",{"$nulls":4},"単 価",{"$nulls":8},"金　　額"]
[{"$f":"$A28","v":0},{"$nulls":3},{"$f":"$E28","v":0},{"$nulls":3},{"$f":"I28","v":0},{"$nulls":38},{"$f":"AV74","v":0},null,null,{"$f":"AY28","v":0},{"$nulls":4},{"$f":"$BD28","v":{"v":0,"d":"0."}},{"$nulls":7},{"$f":"$BL28","v":{"v":0,"d":"0."}},{"$nulls":4},{"$f":"$BQ28","v":{"v":0,"d":"0."}},{"$nulls":8},{"$f":"$BZ28","v":{"v":0,"d":"0 "}}]
[0,{"$nulls":3},0,{"$nulls":3},{"$f":"I29","v":0},{"$nulls":38},0,null,null,0,{"$nulls":4},{"v":0,"d":"0."},{"$nulls":7},{"v":0,"d":"0."},{"$nulls":4},{"v":0,"d":"0."},{"$nulls":8},{"v":0,"d":"0 "}]
[0,{"$nulls":3},0,{"$nulls":3},0,{"$nulls":38},0,null,null,0,{"$nulls":4},{"v":0,"d":"0."},{"$nulls":7},{"v":0,"d":"0."},{"$nulls":4},{"v":0,"d":"0."},{"$nulls":7},{"v":250000,"d":"250,000."},{"v":0,"d":"0 "}]
[0,{"$nulls":3},0,{"$nulls":3},0,{"$nulls":38},0,null,null,0,{"$nulls":4},{"v":0,"d":"0."},{"$nulls":7},{"v":0,"d":"0."},{"$nulls":4},{"v":0,"d":"0."},{"$nulls":8},{"v":0,"d":"0 "}]
[0,{"$nulls":3},0,{"$nulls":3},0,{"$nulls":38},0,null,null,0,{"$nulls":4},{"v":0,"d":"0."},{"$nulls":7},{"v":0,"d":"0."},{"$nulls":4},{"v":0,"d":"0."},{"$nulls":8},{"v":0,"d":"0 "}]
[0,{"$nulls":3},0,{"$nulls":3},0,{"$nulls":38},0,null,null,0,{"$nulls":4},{"v":0,"d":"0."},{"$nulls":7},{"v":0,"d":"0."},{"$nulls":4},{"v":0,"d":"0."},{"$nulls":8},{"v":0,"d":"0 "}]
[0,{"$nulls":3},0,{"$nulls":3},0,{"$nulls":38},0,null,null,0,{"$nulls":4},{"v":0,"d":"0."},{"$nulls":7},{"v":0,"d":"0."},{"$nulls":4},{"v":0,"d":"0."},{"$nulls":7},{"v":250000,"d":"250,000."},{"v":0,"d":"0 "}]
["※は軽減税率対象項目\n０ は非課税、不課税対象項目",{"$nulls":62},"非・不課税 対象小計",{"$nulls":13},{"$f":"$BZ$35","v":{"v":0,"d":"0 "}}]
[{"$nulls":63},"8% 対象小計",{"$nulls":13},{"$f":"$BZ$36","v":{"v":0,"d":"0 "}}]
[{"$nulls":63},"10% 対象小計",{"$nulls":13},{"$f":"$BZ$37","v":{"v":0,"d":"0 "}}]
[{"$nulls":63},"非・不課税 対象合計",{"$nulls":13},{"$f":"$BZ$38","v":{"v":0,"d":"0 "}}]
["酒井鈴木工業工事担当者",{"$nulls":32},"8%税額",{"$nulls":13},{"$f":"$AV$39","v":{"v":0,"d":"0 "}},{"$nulls":15},"8% 対象合計",{"$nulls":13},{"$f":"$BZ$39","v":{"v":0,"d":"0 "}}]
[{"$f":"$A$40","v":0},{"$nulls":32},"10%税額",{"$nulls":13},{"$f":"$AV$40","v":{"v":0,"d":"0 "}},{"$nulls":15},"10% 対象合計",{"$nulls":13},{"$f":"$BZ$40","v":{"v":0,"d":"0 "}}]
[{"$nulls":33},"請 求 合 計 金 額（税込）",{"$nulls":29},{"$f":"$BL$41","v":{"v":0,"d":"0 "}}]

{"sheet":"内訳欄（２）-1","index":1,"n_rows":95,"n_cols":11,"rows_kept":95,"merged":[[1,0,1,2],[1,4,1,5],[1,6,1,9],[3,0,3,1],[3,2,3,4],[4,2,4,4],[5,2,5,4],[6,2,6,4],[7,2,7,4],[8,2,8,4],[9,2,9,4],[10,2,10,4],[11,2,11,4],[12,2,12,4],[13,2,13,4],[14,2,14,4],[15,2,15,4],[16,2,16,4],[17,2,17,4],[18,2,18,4],[19,2,19,4],[20,2,20,4],[21,2,21,4],[22,2,22,4],[23,2,23,4],[24,2,24,4],[25,2,25,4],[26,0,26,4],[26,8,26,9],[27,8,27,9],[28,0,28,3],[28,8,28,9],[29,0,30,3],[30,7,30,10],[33,0,33,2],[33,4,33,5],[33,6,33,9],[35,0,35,1],[35,2,35,4],[36,2,36,4],[37,2,37,4],[38,2,38,4],[39,2,39,4],[40,2,40,4],[41,2,41,4],[42,2,42,4],[43,2,43,4],[44,2,44,4],[45,2,45,4],[46,2,46,4],[47,2,47,4],[48,2,48,4],[49,2,49,4],[50,2,50,4],[51,2,51,4],[52,2,52,4],[53,2,53,4],[54,2,54,4],[55,2,55,4],[56,2,56,4],[57,2,57,4],[58,0,58,4],[58,8,58,9],[59,8,59,9],[60,0,60,3],[60,8,60,9],[61,0,62,3],[62,7,62,10],[65,0,65,2],[65,4,65,5],[65,6,65,9],[67,0,67,1],[67,2,67,4],[68,2,68,4],[69,2,69,4],[70,2,70,4],[71,2,71,4],[72,2,72,4],[73,2,73,4],[74,2,74,4],[75,2,75,4],[76,2,76,4],[77,2,77,4],[78,2,78,4],[79,2,79,4],[80,2,80,4],[81,2,81,4],[82,2,82,4],[83,2,83,4],[84,2,84,4],[85,2,85,4],[86,2,86,4],[87,2,87,4],[88,2,88,4],[89,2,89,4],[90,0,90,4],[90,8,90,9],[91,8,91,9],[92,0,92,3],[92,8,92,9],[93,0,94,3],[94,7,94,10]]}
["内訳欄（２）－①",{"$nulls":9},{"$f":"IF('内訳欄（１）'!CH1=\"\",\"No. \",\"No. \"&TEXT('内訳欄（１）'!CH1,0))","v":"No. "}]
["工事番号",null,null,{"$f":"'内訳欄（１）'!$Q$10","v":0},"工事名",null,{"$f":"'内訳欄（１）'!$AU$10","v":0},{"$nulls":3},"①取引先控"]
[]
["月 日",null,"内　　　　　　　　訳",null,null,"税率\n区分","科目","数　量","単位","単　価","金　　　　額"]
[{"$nulls":10},{"$f":"ROUND(H5*J5,0)","v":{"v":0,"d":"0 "}}]
[{"$nulls":10},{"$f":"ROUND(H6*J6,0)","v":{"v":0,"d":"0 "}}]
[{"$nulls":10},{"v":0,"d":"0 "}]
[{"$nulls":10},{"v":0,"d":"0 "}]
[{"$nulls":10},{"v":0,"d":"0 "}]
[{"$nulls":10},{"v":0,"d":"0 "}]
[{"$nulls":10},{"v":0,"d":"0 "}]
[{"$nulls":10},{"v":0,"d":"0 "}]
[{"$nulls":10},{"v":0,"d":"0 "}]
[{"$nulls":10},{"v":0,"d":"0 "}]
[{"$nulls":10},{"v":0,"d":"0 "}]
[{"$nulls":10},{"v":0,"d":"0 "}]
[{"$nulls":10},{"v":0,"d":"0 "}]
[{"$nulls":10},{"v":0,"d":"0 "}]
[{"$nulls":10},{"v":0,"d":"0 "}]
[{"$nulls":10},{"v":0,"d":"0 "}]
[{"$nulls":10},{"v":0,"d":"0 "}]
[{"$nulls":10},{"v":0,"d":"0 "}]
[{"$nulls":10},{"v":0,"d":"0 "}]
[{"$nulls":10},{"v":0,"d":"0 "}]
[{"$nulls":10},{"v":0,"d":"0 "}]
[{"$nulls":10},{"v":0,"d":"0 "}]
["※は軽減税率対象項目\n０ は非課税、不課税対象項目",{"$nulls":7},"非・不課税 対象小計",null,{"$f":"SUMIF(F5:F26,\"0\",K5:K26)","v":{"v":0,"d":"0 "}}]
[{"$nulls":8},"8% 対象小計",null,{"$f":"SUMIF(F5:F26,\"※\",K5:K26)","v":{"v":0,"d":"0 "}}]
["酒井鈴木工業工事担当者",{"$nulls":7},"10% 対象小計",null,{"$f":"SUMIF(F5:F26,\"\",K5:K26)","v":{"v":0,"d":"0 "}}]
[{"$f":"'内訳欄（１）'!A40","v":0}]
[{"$nulls":7},"　　酒 井 鈴 木 工 業　株 式 会 社"]
[]
["内訳欄（２）－①",{"$nulls":9},{"$f":"$K$1","v":"No. "}]
["工事番号",null,null,{"$f":"D2","v":0},"工事名",null,{"$f":"G2","v":0},{"$nulls":3},"②提出用（経理)"]
[]
["月 日",null,"内　　　　　　　　訳",null,null,"税率\n区分","科目","数　量","単位","単　価","金　　　　額"]
[{"$f":"$A5","v":0},{"$f":"$B5","v":0},{"$f":"C5","v":0},{"$nulls":3},{"$f":"$G5","v":0},{"$f":"$H5","v":{"v":0,"d":"0."}},{"$f":"$I5","v":0},{"$f":"$J5","v":{"v":0,"d":"0."}},{"$f":"$K5","v":{"v":0,"d":"0 "}}]
[0,0,0,null,null,{"$f":"F6","v":0},0,{"v":0,"d":"0."},0,{"v":0,"d":"0."},{"v":0,"d":"0 "}]
[0,0,0,null,null,0,0,{"v":0,"d":"0."},0,{"v":0,"d":"0."},{"v":0,"d":"0 "}]
[0,0,0,null,null,0,0,{"v":0,"d":"0."},0,{"v":0,"d":"0."},{"v":0,"d":"0 "}]
[0,0,0,null,null,0,0,{"v":0,"d":"0."},0,{"v":0,"d":"0."},{"v":0,"d":"0 "}]
[0,0,0,null,null,0,0,{"v":0,"d":"0."},0,{"v":0,"d":"0."},{"v":0,"d":"0 "}]
[0,0,0,null,null,0,0,{"v":0,"d":"0."},0,{"v":0,"d":"0."},{"v":0,"d":"0 "}]
[0,0,0,null,null,0,0,{"v":0,"d":"0."},0,{"v":0,"d":"0."},{"v":0,"d":"0 "}]
[0,0,0,null,null,0,0,{"v":0,"d":"0."},0,{"v":0,"d":"0."},{"v":0,"d":"0 "}]
[0,0,0,null,null,0,0,{"v":0,"d":"0."},0,{"v":0,"d":"0."},{"v":0,"d":"0 "}]
[0,0,0,null,null,0,0,{"v":0,"d":"0."},0,{"v":0,"d":"0."},{"v":0,"d":"0 "}]
[0,0,0,null,null,0,0,{"v":0,"d":"0."},0,{"v":0,"d":"0."},{"v":0,"d":"0 "}]
[0,0,0,null,null,0,0,{"v":0,"d":"0."},0,{"v":0,"d":"0."},{"v":0,"d":"0 "}]
[0,0,0,null,null,0,0,{"v":0,"d":"0."},0,{"v":0,"d":"0."},{"v":0,"d":"0 "}]
[0,0,0,null,null,0,0,{"v":0,"d":"0."},0,{"v":0,"d":"0."},{"v":0,"d":"0 "}]
[0,0,0,null,null,0,0,{"v":0,"d":"0."},0,{"v":0,"d":"0."},{"v":0,"d":"0 "}]
[0,0,0,null,null,0,0,{"v":0,"d":"0."},0,{"v":0,"d":"0."},{"v":0,"d":"0 "}]
[0,0,0,null,null,0,0,{"v":0,"d":"0."},0,{"v":0,"d":"0."},{"v":0,"d":"0 "}]
[0,0,0,null,null,0,0,{"v":0,"d":"0."},0,{"v":0,"d":"0."},{"v":0,"d":"0 "}]
[0,0,0,null,null,0,0,{"v":0,"d":"0."},0,{"v":0,"d":"0."},{"v":0,"d":"0 "}]
[0,0,0,null,null,0,0,{"v":0,"d":"0."},0,{"v":0,"d":"0."},{"v":0,"d":"0 "}]
[0,0,0,null,null,0,0,{"v":0,"d":"0."},0,{"v":0,"d":"0."},{"v":0,"d":"0 "}]
["※は軽減税率対象項目\n０ は非課税、不課税対象項目",{"$nulls":7},"非・不課税 対象小計",null,{"$f":"K27","v":{"v":0,"d":"0 "}}]
[{"$nulls":8},"8% 対象小計",null,{"v":0,"d":"0 "}]
["酒井鈴木工業工事担当者",{"$nulls":7},"10% 対象小計",null,{"v":0,"d":"0 "}]
[{"$f":"A30","v":0}]
[{"$nulls":7},"　　酒 井 鈴 木 工 業　株 式 会 社"]
[]
["内訳欄（２）－①",{"$nulls":9},{"$f":"$K$1","v":"No. "}]
["工事番号",null,null,{"$f":"D2","v":0},"工事名",null,{"$f":"G2","v":0},{"$nulls":3},"③提出用（担当者控）"]
[]
["月 日",null,"内　　　　　　　　訳",null,null,"税率\n区分","科目","数　量","単位","単　価","金　　　　額"]
[{"$f":"$A5","v":0},{"$f":"$B5","v":0},{"$f":"C5","v":0},null,null,{"$f":"F37","v":0},{"$f":"$G5","v":0},{"$f":"$H5","v":{"v":0,"d":"0."}},{"$f":"$I5","v":0},{"$f":"$J5","v":{"v":0,"d":"0."}},{"$f":"$K5","v":{"v":0,"d":"0 "}}]
[0,0,0,null,null,0,0,{"v":0,"d":"0."},0,{"v":0,"d":"0."},{"v":0,"d":"0 "}]
[0,0,0,null,null,0,0,{"v":0,"d":"0."},0,{"v":0,"d":"0."},{"v":0,"d":"0 "}]
[0,0,0,null,null,0,0,{"v":0,"d":"0."},0,{"v":0,"d":"0."},{"v":0,"d":"0 "}]
[0,0,0,null,null,0,0,{"v":0,"d":"0."},0,{"$f":"$J9","v":{"v":0,"d":"0."}},{"v":0,"d":"0 "}]
[0,0,0,null,null,0,0,{"v":0,"d":"0."},0,{"v":0,"d":"0."},{"v":0,"d":"0 "}]
[0,0,0,null,null,0,0,{"v":0,"d":"0."},0,{"v":0,"d":"0."},{"v":0,"d":"0 "}]
[0,0,0,null,null,0,0,{"v":0,"d":"0."},0,{"v":0,"d":"0."},{"v":0,"d":"0 "}]
[0,0,0,null,null,0,0,{"v":0,"d":"0."},0,{"v":0,"d":"0."},{"v":0,"d":"0 "}]
[0,0,0,null,null,0,0,{"v":0,"d":"0."},0,{"v":0,"d":"0."},{"v":0,"d":"0 "}]
[0,0,0,null,null,0,0,{"v":0,"d":"0."},0,{"v":0,"d":"0."},{"v":0,"d":"0 "}]
[0,0,0,null,null,0,0,{"v":0,"d":"0."},0,{"v":0,"d":"0."},{"v":0,"d":"0 "}]
[0,0,0,null,null,0,0,{"v":0,"d":"0."},0,{"v":0,"d":"0."},{"v":0,"d":"0 "}]
[0,0,0,null,null,0,0,{"v":0,"d":"0."},0,{"v":0,"d":"0."},{"v":0,"d":"0 "}]
[0,0,0,null,null,0,0,{"v":0,"d":"0."},0,{"v":0,"d":"0."},{"v":0,"d":"0 "}]
[0,0,0,null,null,0,0,{"v":0,"d":"0."},0,{"v":0,"d":"0."},{"v":0,"d":"0 "}]
[0,0,0,null,null,0,0,{"v":0,"d":"0."},0,{"v":0,"d":"0."},{"v":0,"d":"0 "}]
[0,0,0,null,null,0,0,{"v":0,"d":"0."},0,{"v":0,"d":"0."},{"v":0,"d":"0 "}]
[0,0,0,null,null,0,0,{"v":0,"d":"0."},0,{"v":0,"d":"0."},{"v":0,"d":"0 "}]
[0,0,0,null,null,0,0,{"v":0,"d":"0."},0,{"v":0,"d":"0."},{"v":0,"d":"0 "}]
[0,0,0,null,null,0,0,{"v":0,"d":"0."},0,{"v":0,"d":"0."},{"v":0,"d":"0 "}]
[0,0,0,null,null,0,0,{"v":0,"d":"0."},0,{"v":0,"d":"0."},{"v":0,"d":"0 "}]
["※は軽減税率対象項目\n０ は非課税、不課税対象項目",{"$nulls":7},"非・不課税 対象小計",null,{"$f":"K27","v":{"v":0,"d":"0 "}}]
[{"$nulls":8},"8% 対象小計",null,{"v":0,"d":"0 "}]
["酒井鈴木工業工事担当者",{"$nulls":7},"10% 対象小計",null,{"v":0,"d":"0 "}]
[{"$f":"A30","v":0}]
[{"$nulls":7},"　　酒 井 鈴 木 工 業　株 式 会 社"]

{"sheet":"内訳欄（２）-2","index":2,"n_rows":95,"n_cols":11,"rows_kept":95,"merged":[[1,0,1,2],[1,4,1,5],[1,6,1,9],[3,0,3,1],[3,2,3,4],[4,2,4,4],[5,2,5,4],[6,2,6,4],[7,2,7,4],[8,2,8,4],[9,2,9,4],[10,2,10,4],[11,2,11,4],[12,2,12,4],[13,2,13,4],[14,2,14,4],[15,2,15,4],[16,2,16,4],[17,2,17,4],[18,2,18,4],[19,2,19,4],[20,2,20,4],[21,2,21,4],[22,2,22,4],[23,2,23,4],[24,2,24,4],[25,2,25,4],[26,0,26,4],[26,8,26,9],[27,8,27,9],[28,0,28,3],[28,8,28,9],[29,0,30,3],[30,7,30,10],[33,0,33,2],[33,4,33,5],[33,6,33,9],[35,0,35,1],[35,2,35,4],[36,2,36,4],[37,2,37,4],[38,2,38,4],[39,2,39,4],[40,2,40,4],[41,2,41,4],[42,2,42,4],[43,2,43,4],[44,2,44,4],[45,2,45,4],[46,2,46,4],[47,2,47,4],[48,2,48,4],[49,2,49,4],[50,2,50,4],[51,2,51,4],[52,2,52,4],[53,2,53,4],[54,2,54,4],[55,2,55,4],[56,2,56,4],[57,2,57,4],[58,0,58,4],[58,8,58,9],[59,8,59,9],[60,0,60,3],[60,8,60,9],[61,0,62,3],[62,7,62,10],[65,0,65,2],[65,4,65,5],[65,6,65,9],[67,0,67,1],[67,2,67,4],[68,2,68,4],[69,2,69,4],[70,2,70,4],[71,2,71,4],[72,2,72,4],[73,2,73,4],[74,2,74,4],[75,2,75,4],[76,2,76,4],[77,2,77,4],[78,2,78,4],[79,2,79,4],[80,2,80,4],[81,2,81,4],[82,2,82,4],[83,2,83,4],[84,2,84,4],[85,2,85,4],[86,2,86,4],[87,2,87,4],[88,2,88,4],[89,2,89,4],[90,0,90,4],[90,8,90,9],[91,8,91,9],[92,0,92,3],[92,8,92,9],[93,0,94,3],[94,7,94,10]]}
["内訳欄（２）－②",{"$nulls":9},{"$f":"IF('内訳欄（１）'!CH1=\"\",\"No. \",\"No. \"&TEXT('内訳欄（１）'!CH1,0))","v":"No. "}]
["工事番号",null,null,{"$f":"'内訳欄（１）'!$Q$10","v":0},"工事名",null,{"$f":"'内訳欄（１）'!$AU$10","v":0},{"$nulls":3},"①取引先控"]
[]
["月 日",null,"内　　　　　　　　訳",null,null,"税率\n区分","科目","数　量","単位","単　価","金　　　　額"]
[{"$nulls":10},{"$f":"ROUND(H5*J5,0)","v":{"v":0,"d":"0 "}}]
[{"$nulls":10},{"$f":"ROUND(H6*J6,0)","v":{"v":0,"d":"0 "}}]
[{"$nulls":10},{"v":0,"d":"0 "}]
[{"$nulls":10},{"v":0,"d":"0 "}]
[{"$nulls":10},{"v":0,"d":"0 "}]
[{"$nulls":10},{"v":0,"d":"0 "}]
[{"$nulls":10},{"v":0,"d":"0 "}]
[{"$nulls":10},{"v":0,"d":"0 "}]
[{"$nulls":10},{"v":0,"d":"0 "}]
[{"$nulls":10},{"v":0,"d":"0 "}]
[{"$nulls":10},{"v":0,"d":"0 "}]
[{"$nulls":10},{"v":0,"d":"0 "}]
[{"$nulls":10},{"v":0,"d":"0 "}]
[{"$nulls":10},{"v":0,"d":"0 "}]
[{"$nulls":10},{"v":0,"d":"0 "}]
[{"$nulls":10},{"v":0,"d":"0 "}]
[{"$nulls":10},{"v":0,"d":"0 "}]
[{"$nulls":10},{"v":0,"d":"0 "}]
[{"$nulls":10},{"v":0,"d":"0 "}]
[{"$nulls":10},{"v":0,"d":"0 "}]
[{"$nulls":10},{"v":0,"d":"0 "}]
[{"$nulls":10},{"v":0,"d":"0 "}]
["※は軽減税率対象項目\n０ は非課税、不課税対象項目",{"$nulls":7},"非・不課税 対象小計",null,{"$f":"SUMIF(F5:F26,\"0\",K5:K26)","v":{"v":0,"d":"0 "}}]
[{"$nulls":8},"8% 対象小計",null,{"$f":"SUMIF(F5:F26,\"※\",K5:K26)","v":{"v":0,"d":"0 "}}]
["酒井鈴木工業工事担当者",{"$nulls":7},"10% 対象小計",null,{"$f":"SUMIF($F$5:$F$26,\"\",$K$5:$K$26)","v":{"v":0,"d":"0 "}}]
[{"$f":"'内訳欄（１）'!A40","v":0}]
[{"$nulls":7},"　　酒 井 鈴 木 工 業　株 式 会 社"]
[]
["内訳欄（２）－②",{"$nulls":9},{"$f":"$K$1","v":"No. "}]
["工事番号",null,null,{"$f":"D2","v":0},"工事名",null,{"$f":"G2","v":0},{"$nulls":3},"②提出用（経理)"]
[]
["月 日",null,"内　　　　　　　　訳",null,null,"税率\n区分","科目","数　量","単位","単　価","金　　　　額"]
[{"$f":"$A5","v":0},{"$f":"$B5","v":0},{"$f":"C5","v":0},null,null,{"$f":"F5","v":0},{"$f":"$G5","v":0},{"$f":"$H5","v":{"v":0,"d":"0."}},{"$f":"$I5","v":{"v":0,"d":"0."}},{"$f":"$J5","v":{"v":0,"d":"0."}},{"$f":"$K5","v":{"v":0,"d":"0 "}}]
[0,0,0,null,null,0,0,{"v":0,"d":"0."},{"v":0,"d":"0."},{"v":0,"d":"0."},{"v":0,"d":"0 "}]
[0,0,0,null,null,0,0,{"v":0,"d":"0."},{"v":0,"d":"0."},{"v":0,"d":"0."},{"v":0,"d":"0 "}]
[0,0,0,null,null,0,0,{"v":0,"d":"0."},{"v":0,"d":"0."},{"v":0,"d":"0."},{"v":0,"d":"0 "}]
[0,0,0,null,null,0,0,{"v":0,"d":"0."},{"v":0,"d":"0."},{"v":0,"d":"0."},{"v":0,"d":"0 "}]
[0,0,0,null,null,0,0,{"v":0,"d":"0."},{"v":0,"d":"0."},{"v":0,"d":"0."},{"v":0,"d":"0 "}]
[0,0,0,null,null,0,0,{"v":0,"d":"0."},{"v":0,"d":"0."},{"v":0,"d":"0."},{"v":0,"d":"0 "}]
[0,0,0,null,null,0,0,{"v":0,"d":"0."},{"v":0,"d":"0."},{"v":0,"d":"0."},{"v":0,"d":"0 "}]
[0,0,0,null,null,0,0,{"v":0,"d":"0."},{"v":0,"d":"0."},{"v":0,"d":"0."},{"v":0,"d":"0 "}]
[0,0,0,null,null,0,0,{"v":0,"d":"0."},{"v":0,"d":"0."},{"v":0,"d":"0."},{"v":0,"d":"0 "}]
[0,0,0,null,null,0,0,{"v":0,"d":"0."},{"v":0,"d":"0."},{"v":0,"d":"0."},{"v":0,"d":"0 "}]
[0,0,0,null,null,0,0,{"v":0,"d":"0."},{"v":0,"d":"0."},{"v":0,"d":"0."},{"v":0,"d":"0 "}]
[0,0,0,null,null,0,0,{"v":0,"d":"0."},{"v":0,"d":"0."},{"v":0,"d":"0."},{"v":0,"d":"0 "}]
[0,0,0,null,null,0,0,{"v":0,"d":"0."},{"v":0,"d":"0."},{"v":0,"d":"0."},{"v":0,"d":"0 "}]
[0,0,0,null,null,0,0,{"v":0,"d":"0."},{"v":0,"d":"0."},{"v":0,"d":"0."},{"v":0,"d":"0 "}]
[0,0,0,null,null,0,0,{"v":0,"d":"0."},{"v":0,"d":"0."},{"v":0,"d":"0."},{"v":0,"d":"0 "}]
[0,0,0,null,null,0,0,{"v":0,"d":"0."},{"v":0,"d":"0."},{"v":0,"d":"0."},{"v":0,"d":"0 "}]
[0,0,0,null,null,0,0,{"v":0,"d":"0."},{"v":0,"d":"0."},{"v":0,"d":"0."},{"v":0,"d":"0 "}]
[0,0,0,null,null,0,0,{"v":0,"d":"0."},{"v":0,"d":"0."},{"v":0,"d":"0."},{"v":0,"d":"0 "}]
[0,0,0,null,null,0,0,{"v":0,"d":"0."},{"v":0,"d":"0."},{"v":0,"d":"0."},{"v":0,"d":"0 "}]
[0,0,0,null,null,0,0,{"v":0,"d":"0."},{"v":0,"d":"0."},{"v":0,"d":"0."},{"v":0,"d":"0 "}]
[0,0,0,null,null,0,0,{"v":0,"d":"0."},{"v":0,"d":"0."},{"v":0,"d":"0."},{"v":0,"d":"0 "}]
["※は軽減税率対象項目\n０ は非課税、不課税対象項目",{"$nulls":7},"非・不課税 対象小計",null,{"$f":"K27","v":{"v":0,"d":"0 "}}]
[{"$nulls":8},"8% 対象小計",null,{"v":0,"d":"0 "}]
["酒井鈴木工業工事担当者",{"$nulls":7},"10% 対象小計",null,{"v":0,"d":"0 "}]
[{"$f":"A30","v":0}]
[{"$nulls":7},"　　酒 井 鈴 木 工 業　株 式 会 社"]
[]
["内訳欄（２）－②",{"$nulls":9},{"$f":"$K$1","v":"No. "}]
["工事番号",null,null,{"$f":"D2","v":0},"工事名",null,{"$f":"G2","v":0},{"$nulls":3},"③提出用（担当者控）"]
[]
["月 日",null,"内　　　　　　　　訳",null,null,"税率\n区分","科目","数　量","単位","単　価","金　　　　額"]
[{"$f":"$A5","v":0},{"$f":"$B5","v":0},{"$f":"C37","v":0},null,null,{"$f":"F5","v":0},{"$f":"$G5","v":0},{"$f":"$H5","v":{"v":0,"d":"0."}},{"$f":"$I5","v":{"v":0,"d":"0."}},{"$f":"$J5","v":{"v":0,"d":"0."}},{"$f":"$K5","v":{"v":0,"d":"0 "}}]
[0,0,0,null,null,0,0,{"v":0,"d":"0."},{"v":0,"d":"0."},{"v":0,"d":"0."},{"v":0,"d":"0 "}]
[0,0,0,null,null,0,0,{"v":0,"d":"0."},{"v":0,"d":"0."},{"v":0,"d":"0."},{"v":0,"d":"0 "}]
[0,0,0,null,null,0,0,{"v":0,"d":"0."},{"v":0,"d":"0."},{"v":0,"d":"0."},{"v":0,"d":"0 "}]
[0,0,0,null,null,0,0,{"v":0,"d":"0."},{"v":0,"d":"0."},{"v":0,"d":"0."},{"v":0,"d":"0 "}]
[0,0,0,null,null,0,0,{"v":0,"d":"0."},{"v":0,"d":"0."},{"v":0,"d":"0."},{"v":0,"d":"0 "}]
[0,0,0,null,null,0,0,{"v":0,"d":"0."},{"v":0,"d":"0."},{"v":0,"d":"0."},{"v":0,"d":"0 "}]
[0,0,0,null,null,0,0,{"v":0,"d":"0."},{"v":0,"d":"0."},{"v":0,"d":"0."},{"v":0,"d":"0 "}]
[0,0,0,null,null,0,0,{"v":0,"d":"0."},{"v":0,"d":"0."},{"v":0,"d":"0."},{"v":0,"d":"0 "}]
[0,0,0,null,null,0,0,{"v":0,"d":"0."},{"v":0,"d":"0."},{"v":0,"d":"0."},{"v":0,"d":"0 "}]
[0,0,0,null,null,0,0,{"v":0,"d":"0."},{"v":0,"d":"0."},{"v":0,"d":"0."},{"v":0,"d":"0 "}]
[0,0,0,null,null,0,0,{"v":0,"d":"0."},{"v":0,"d":"0."},{"v":0,"d":"0."},{"v":0,"d":"0 "}]
[0,0,0,null,null,0,0,{"v":0,"d":"0."},{"v":0,"d":"0."},{"v":0,"d":"0."},{"v":0,"d":"0 "}]
[0,0,0,null,null,0,0,{"v":0,"d":"0."},{"v":0,"d":"0."},{"v":0,"d":"0."},{"v":0,"d":"0 "}]
[0,0,0,null,null,0,0,{"v":0,"d":"0."},{"v":0,"d":"0."},{"v":0,"d":"0."},{"v":0,"d":"0 "}]
[0,0,0,null,null,0,0,{"v":0,"d":"0."},{"v":0,"d":"0."},{"v":0,"d":"0."},{"v":0,"d":"0 "}]
[0,0,0,null,null,0,0,{"v":0,"d":"0."},{"v":0,"d":"0."},{"v":0,"d":"0."},{"v":0,"d":"0 "}]
[0,0,0,null,null,0,0,{"v":0,"d":"0."},{"v":0,"d":"0."},{"v":0,"d":"0."},{"v":0,"d":"0 "}]
[0,0,0,null,null,0,0,{"v":0,"d":"0."},{"v":0,"d":"0."},{"v":0,"d":"0."},{"v":0,"d":"0 "}]
[0,0,0,null,null,0,0,{"v":0,"d":"0."},{"v":0,"d":"0."},{"v":0,"d":"0."},{"v":0,"d":"0 "}]
[0,0,0,null,null,0,0,{"v":0,"d":"0."},{"v":0,"d":"0."},{"v":0,"d":"0."},{"v":0,"d":"0 "}]
[0,0,0,null,null,0,0,{"v":0,"d":"0."},{"v":0,"d":"0."},{"v":0,"d":"0."},{"v":0,"d":"0 "}]
["※は軽減税率対象項目\n０ は非課税、不課税対象項目",{"$nulls":7},"非・不課税 対象小計",null,{"$f":"K27","v":{"v":0,"d":"0 "}}]
[{"$nulls":8},"8% 対象小計",null,{"v":0,"d":"0 "}]
["酒井鈴木工業工事担当者",{"$nulls":7},"10% 対象小計",null,{"v":0,"d":"0 "}]
[{"$f":"A30","v":0}]
[{"$nulls":7},"　　酒 井 鈴 木 工 業　株 式 会 社"]

{"sheet":"内訳欄（２）-3","index":3,"n_rows":95,"n_cols":11,"rows_kept":95,"merged":[[1,0,1,2],[1,4,1,5],[1,6,1,9],[3,0,3,1],[3,2,3,4],[4,2,4,4],[5,2,5,4],[6,2,6,4],[7,2,7,4],[8,2,8,4],[9,2,9,4],[10,2,10,4],[11,2,11,4],[12,2,12,4],[13,2,13,4],[14,2,14,4],[15,2,15,4],[16,2,16,4],[17,2,17,4],[18,2,18,4],[19,2,19,4],[20,2,20,4],[21,2,21,4],[22,2,22,4],[23,2,23,4],[24,2,24,4],[25,2,25,4],[26,0,26,4],[26,8,26,9],[27,8,27,9],[28,0,28,3],[28,8,28,9],[29,0,30,3],[30,7,30,10],[33,0,33,2],[33,4,33,5],[33,6,33,9],[35,0,35,1],[35,2,35,4],[36,2,36,4],[37,2,37,4],[38,2,38,4],[39,2,39,4],[40,2,40,4],[41,2,41,4],[42,2,42,4],[43,2,43,4],[44,2,44,4],[45,2,45,4],[46,2,46,4],[47,2,47,4],[48,2,48,4],[49,2,49,4],[50,2,50,4],[51,2,51,4],[52,2,52,4],[53,2,53,4],[54,2,54,4],[55,2,55,4],[56,2,56,4],[57,2,57,4],[58,0,58,4],[58,8,58,9],[59,8,59,9],[60,0,60,3],[60,8,60,9],[61,0,62,3],[62,7,62,10],[65,0,65,2],[65,4,65,5],[65,6,65,9],[67,0,67,1],[67,2,67,4],[68,2,68,4],[69,2,69,4],[70,2,70,4],[71,2,71,4],[72,2,72,4],[73,2,73,4],[74,2,74,4],[75,2,75,4],[76,2,76,4],[77,2,77,4],[78,2,78,4],[79,2,79,4],[80,2,80,4],[81,2,81,4],[82,2,82,4],[83,2,83,4],[84,2,84,4],[85,2,85,4],[86,2,86,4],[87,2,87,4],[88,2,88,4],[89,2,89,4],[90,0,90,4],[90,8,90,9],[91,8,91,9],[92,0,92,3],[92,8,92,9],[93,0,94,3],[94,7,94,10]]}
["内訳欄（２）－③",{"$nulls":9},{"$f":"IF('内訳欄（１）'!CH1=\"\",\"No. \",\"No. \"&TEXT('内訳欄（１）'!CH1,0))","v":"No. "}]
["工事番号",null,null,{"$f":"'内訳欄（１）'!$Q$10","v":0},"工事名",null,{"$f":"'内訳欄（１）'!$AU$10","v":0},{"$nulls":3},"①取引先控"]
[]
["月 日",null,"内　　　　　　　　訳",null,null,"税率\n区分","科目","数　量","単位","単　価","金　　　　額"]
[{"$nulls":10},{"$f":"ROUND(H5*J5,0)","v":{"v":0,"d":"0 "}}]
[{"$nulls":10},{"$f":"ROUND(H6*J6,0)","v":{"v":0,"d":"0 "}}]
[{"$nulls":10},{"v":0,"d":"0 "}]
[{"$nulls":10},{"v":0,"d":"0 "}]
[{"$nulls":10},{"v":0,"d":"0 "}]
[{"$nulls":10},{"v":0,"d":"0 "}]
[{"$nulls":10},{"v":0,"d":"0 "}]
[{"$nulls":10},{"v":0,"d":"0 "}]
[{"$nulls":10},{"v":0,"d":"0 "}]
[{"$nulls":10},{"v":0,"d":"0 "}]
[{"$nulls":10},{"v":0,"d":"0 "}]
[{"$nulls":10},{"v":0,"d":"0 "}]
[{"$nulls":10},{"v":0,"d":"0 "}]
[{"$nulls":10},{"v":0,"d":"0 "}]
[{"$nulls":10},{"v":0,"d":"0 "}]
[{"$nulls":10},{"v":0,"d":"0 "}]
[{"$nulls":10},{"v":0,"d":"0 "}]
[{"$nulls":10},{"v":0,"d":"0 "}]
[{"$nulls":10},{"v":0,"d":"0 "}]
[{"$nulls":10},{"v":0,"d":"0 "}]
[{"$nulls":10},{"v":0,"d":"0 "}]
[{"$nulls":10},{"v":0,"d":"0 "}]
["※は軽減税率対象項目\n０ は非課税、不課税対象項目",{"$nulls":7},"非・不課税 対象小計",null,{"$f":"SUMIF($F$5:$F$26,\"0\",$K$5:$K$26)","v":{"v":0,"d":"0 "}}]
[{"$nulls":8},"8% 対象小計",null,{"$f":"SUMIF($F$5:$F$26,\"※\",$K$5:$K$26)","v":{"v":0,"d":"0 "}}]
["酒井鈴木工業工事担当者",{"$nulls":7},"10% 対象小計",null,{"$f":"SUMIF($F$5:$F$26,\"\",$K$5:$K$26)","v":{"v":0,"d":"0 "}}]
[{"$f":"'内訳欄（１）'!A40","v":0}]
[{"$nulls":7},"　　酒 井 鈴 木 工 業　株 式 会 社"]
[]
["内訳欄（２）－③",{"$nulls":9},{"$f":"$K$1","v":"No. "}]
["工事番号",null,null,{"$f":"D2","v":0},"工事名",null,{"$f":"G2","v":0},{"$nulls":3},"②提出用（経理)"]
[]
["月 日",null,"内　　　　　　　　訳",null,null,"税率\n区分","科目","数　量","単位","単　価","金　　　　額"]
[{"$f":"$A5","v":0},{"$f":"$B5","v":0},{"$f":"C5","v":0},null,null,{"$f":"F5","v":0},{"$f":"$G5","v":0},{"$f":"$H5","v":{"v":0,"d":"0."}},{"$f":"$I5","v":{"v":0,"d":"0."}},{"$f":"$J5","v":{"v":0,"d":"0."}},{"$f":"$K5","v":{"v":0,"d":"0 "}}]
[0,0,0,null,null,0,0,{"v":0,"d":"0."},{"v":0,"d":"0."},{"v":0,"d":"0."},{"v":0,"d":"0 "}]
[0,0,0,null,null,0,0,{"v":0,"d":"0."},{"v":0,"d":"0."},{"v":0,"d":"0."},{"v":0,"d":"0 "}]
[0,0,0,null,null,0,0,{"v":0,"d":"0."},{"v":0,"d":"0."},{"v":0,"d":"0."},{"v":0,"d":"0 "}]
[0,0,0,null,null,0,0,{"v":0,"d":"0."},{"v":0,"d":"0."},{"v":0,"d":"0."},{"v":0,"d":"0 "}]
[0,0,0,null,null,0,0,{"v":0,"d":"0."},{"v":0,"d":"0."},{"v":0,"d":"0."},{"v":0,"d":"0 "}]
[0,0,0,null,null,0,0,{"v":0,"d":"0."},{"v":0,"d":"0."},{"v":0,"d":"0."},{"v":0,"d":"0 "}]
[0,0,0,null,null,0,0,{"v":0,"d":"0."},{"v":0,"d":"0."},{"v":0,"d":"0."},{"v":0,"d":"0 "}]
[0,0,0,null,null,0,0,{"v":0,"d":"0."},{"v":0,"d":"0."},{"v":0,"d":"0."},{"v":0,"d":"0 "}]
[0,0,0,null,null,0,0,{"v":0,"d":"0."},{"v":0,"d":"0."},{"v":0,"d":"0."},{"v":0,"d":"0 "}]
[0,0,0,null,null,0,0,{"v":0,"d":"0."},{"v":0,"d":"0."},{"v":0,"d":"0."},{"v":0,"d":"0 "}]
[0,0,0,null,null,0,0,{"v":0,"d":"0."},{"v":0,"d":"0."},{"v":0,"d":"0."},{"v":0,"d":"0 "}]
[0,0,0,null,null,0,0,{"v":0,"d":"0."},{"v":0,"d":"0."},{"v":0,"d":"0."},{"v":0,"d":"0 "}]
[0,0,0,null,null,0,0,{"v":0,"d":"0."},{"v":0,"d":"0."},{"v":0,"d":"0."},{"v":0,"d":"0 "}]
[0,0,0,null,null,0,0,{"v":0,"d":"0."},{"v":0,"d":"0."},{"v":0,"d":"0."},{"v":0,"d":"0 "}]
[0,0,0,null,null,0,0,{"v":0,"d":"0."},{"v":0,"d":"0."},{"v":0,"d":"0."},{"v":0,"d":"0 "}]
[0,0,0,null,null,0,0,{"v":0,"d":"0."},{"v":0,"d":"0."},{"v":0,"d":"0."},{"v":0,"d":"0 "}]
[0,0,0,null,null,0,0,{"v":0,"d":"0."},{"v":0,"d":"0."},{"v":0,"d":"0."},{"v":0,"d":"0 "}]
[0,0,0,null,null,0,0,{"v":0,"d":"0."},{"v":0,"d":"0."},{"v":0,"d":"0."},{"v":0,"d":"0 "}]
[0,0,0,null,null,0,0,{"v":0,"d":"0."},{"v":0,"d":"0."},{"v":0,"d":"0."},{"v":0,"d":"0 "}]
[0,0,0,null,null,0,0,{"v":0,"d":"0."},{"v":0,"d":"0."},{"v":0,"d":"0."},{"v":0,"d":"0 "}]
[0,0,0,null,null,0,0,{"v":0,"d":"0."},{"v":0,"d":"0."},{"v":0,"d":"0."},{"v":0,"d":"0 "}]
["※は軽減税率対象項目\n０ は非課税、不課税対象項目",{"$nulls":7},"非・不課税 対象小計",null,{"$f":"K27","v":{"v":0,"d":"0 "}}]
[{"$nulls":8},"8% 対象小計",null,{"v":0,"d":"0 "}]
["酒井鈴木工業工事担当者",{"$nulls":7},"10% 対象小計",null,{"v":0,"d":"0 "}]
[{"$f":"A30","v":0}]
[{"$nulls":7},"　　酒 井 鈴 木 工 業　株 式 会 社"]
[]
["内訳欄（２）－③",{"$nulls":9},{"$f":"$K$1","v":"No. "}]
["工事番号",null,null,{"$f":"D2","v":0},"工事名",null,{"$f":"G2","v":0},{"$nulls":3},"③提出用（担当者控）"]
[]
["月 日",null,"内　　　　　　　　訳",null,null,"税率\n区分","科目","数　量","単位","単　価","金　　　　額"]
[{"$f":"$A5","v":0},{"$f":"$B5","v":0},{"$f":"C5","v":0},null,null,{"$f":"F5","v":0},{"$f":"$G5","v":0},{"$f":"$H5","v":{"v":0,"d":"0."}},{"$f":"$I5","v":{"v":0,"d":"0."}},{"$f":"$J5","v":{"v":0,"d":"0."}},{"$f":"$K5","v":{"v":0,"d":"0 "}}]
[0,0,0,null,null,0,0,{"v":0,"d":"0."},{"v":0,"d":"0."},{"v":0,"d":"0."},{"v":0,"d":"0 "}]
[0,0,0,null,null,0,0,{"v":0,"d":"0."},{"v":0,"d":"0."},{"v":0,"d":"0."},{"v":0,"d":"0 "}]
[0,0,0,null,null,0,0,{"v":0,"d":"0."},{"v":0,"d":"0."},{"v":0,"d":"0."},{"v":0,"d":"0 "}]
[0,0,0,null,null,0,0,{"v":0,"d":"0."},{"v":0,"d":"0."},{"v":0,"d":"0."},{"v":0,"d":"0 "}]
[0,0,0,null,null,0,0,{"v":0,"d":"0."},{"v":0,"d":"0."},{"v":0,"d":"0."},{"v":0,"d":"0 "}]
[0,0,0,null,null,0,0,{"v":0,"d":"0."},{"v":0,"d":"0."},{"v":0,"d":"0."},{"v":0,"d":"0 "}]
[0,0,0,null,null,0,0,{"v":0,"d":"0."},{"v":0,"d":"0."},{"v":0,"d":"0."},{"v":0,"d":"0 "}]
[0,0,0,null,null,0,0,{"v":0,"d":"0."},{"v":0,"d":"0."},{"v":0,"d":"0."},{"v":0,"d":"0 "}]
[0,0,0,null,null,0,0,{"v":0,"d":"0."},{"v":0,"d":"0."},{"v":0,"d":"0."},{"v":0,"d":"0 "}]
[0,0,0,null,null,0,0,{"v":0,"d":"0."},{"v":0,"d":"0."},{"v":0,"d":"0."},{"v":0,"d":"0 "}]
[0,0,0,null,null,0,0,{"v":0,"d":"0."},{"v":0,"d":"0."},{"v":0,"d":"0."},{"v":0,"d":"0 "}]
[0,0,0,null,null,0,0,{"v":0,"d":"0."},{"v":0,"d":"0."},{"v":0,"d":"0."},{"v":0,"d":"0 "}]
[0,0,0,null,null,0,0,{"v":0,"d":"0."},{"v":0,"d":"0."},{"v":0,"d":"0."},{"v":0,"d":"0 "}]
[0,0,0,null,null,0,0,{"v":0,"d":"0."},{"v":0,"d":"0."},{"v":0,"d":"0."},{"v":0,"d":"0 "}]
[0,0,0,null,null,0,0,{"v":0,"d":"0."},{"v":0,"d":"0."},{"v":0,"d":"0."},{"v":0,"d":"0 "}]
[0,0,0,null,null,0,0,{"v":0,"d":"0."},{"v":0,"d":"0."},{"v":0,"d":"0."},{"v":0,"d":"0 "}]
[0,0,0,null,null,0,0,{"v":0,"d":"0."},{"v":0,"d":"0."},{"v":0,"d":"0."},{"v":0,"d":"0 "}]
[0,0,0,null,null,0,0,{"v":0,"d":"0."},{"v":0,"d":"0."},{"v":0,"d":"0."},{"v":0,"d":"0 "}]
[0,0,0,null,null,0,0,{"v":0,"d":"0."},{"v":0,"d":"0."},{"v":0,"d":"0."},{"v":0,"d":"0 "}]
[0,0,0,null,null,0,0,{"v":0,"d":"0."},{"v":0,"d":"0."},{"v":0,"d":"0."},{"v":0,"d":"0 "}]
[0,0,0,null,null,0,0,{"v":0,"d":"0."},{"v":0,"d":"0."},{"v":0,"d":"0."},{"v":0,"d":"0 "}]
["※は軽減税率対象項目\n０ は非課税、不課税対象項目",{"$nulls":7},"非・不課税 対象小計",null,{"$f":"K27","v":{"v":0,"d":"0 "}}]
[{"$nulls":8},"8% 対象小計",null,{"v":0,"d":"0 "}]
["酒井鈴木工業工事担当者",{"$nulls":7},"10% 対象小計",null,{"v":0,"d":"0 "}]
[{"$f":"A30","v":0}]
[{"$nulls":7},"　　酒 井 鈴 木 工 業　株 式 会 社"]

{"sheet":"内訳欄（２）-4","index":4,"n_rows":95,"n_cols":11,"rows_kept":95,"merged":[[1,0,1,2],[1,4,1,5],[1,6,1,9],[3,0,3,1],[3,2,3,4],[4,2,4,4],[5,2,5,4],[6,2,6,4],[7,2,7,4],[8,2,8,4],[9,2,9,4],[10,2,10,4],[11,2,11,4],[12,2,12,4],[13,2,13,4],[14,2,14,4],[15,2,15,4],[16,2,16,4],[17,2,17,4],[18,2,18,4],[19,2,19,4],[20,2,20,4],[21,2,21,4],[22,2,22,4],[23,2,23,4],[24,2,24,4],[25,2,25,4],[26,0,26,4],[26,8,26,9],[27,8,27,9],[28,0,28,3],[28,8,28,9],[29,0,30,3],[30,7,30,10],[33,0,33,2],[33,4,33,5],[33,6,33,9],[35,0,35,1],[35,2,35,4],[36,2,36,4],[37,2,37,4],[38,2,38,4],[39,2,39,4],[40,2,40,4],[41,2,41,4],[42,2,42,4],[43,2,43,4],[44,2,44,4],[45,2,45,4],[46,2,46,4],[47,2,47,4],[48,2,48,4],[49,2,49,4],[50,2,50,4],[51,2,51,4],[52,2,52,4],[53,2,53,4],[54,2,54,4],[55,2,55,4],[56,2,56,4],[57,2,57,4],[58,0,58,4],[58,8,58,9],[59,8,59,9],[60,0,60,3],[60,8,60,9],[61,0,62,3],[62,7,62,10],[65,0,65,2],[65,4,65,5],[65,6,65,9],[67,0,67,1],[67,2,67,4],[68,2,68,4],[69,2,69,4],[70,2,70,4],[71,2,71,4],[72,2,72,4],[73,2,73,4],[74,2,74,4],[75,2,75,4],[76,2,76,4],[77,2,77,4],[78,2,78,4],[79,2,79,4],[80,2,80,4],[81,2,81,4],[82,2,82,4],[83,2,83,4],[84,2,84,4],[85,2,85,4],[86,2,86,4],[87,2,87,4],[88,2,88,4],[89,2,89,4],[90,0,90,4],[90,8,90,9],[91,8,91,9],[92,0,92,3],[92,8,92,9],[93,0,94,3],[94,7,94,10]]}
["内訳欄（２）－④",{"$nulls":9},{"$f":"IF('内訳欄（１）'!CH1=\"\",\"No. \",\"No. \"&TEXT('内訳欄（１）'!CH1,0))","v":"No. "}]
["工事番号",null,null,{"$f":"'内訳欄（１）'!$Q$10","v":0},"工事名",null,{"$f":"'内訳欄（１）'!$AU$10","v":0},{"$nulls":3},"①取引先控"]
[]
["月 日",null,"内　　　　　　　　訳",null,null,"税率\n区分","科目","数　量","単位","単　価","金　　　　額"]
[{"$nulls":10},{"$f":"ROUND(H5*J5,0)","v":{"v":0,"d":"0 "}}]
[{"$nulls":10},{"$f":"ROUND(H6*J6,0)","v":{"v":0,"d":"0 "}}]
[{"$nulls":10},{"v":0,"d":"0 "}]
[{"$nulls":10},{"v":0,"d":"0 "}]
[{"$nulls":10},{"v":0,"d":"0 "}]
[{"$nulls":10},{"v":0,"d":"0 "}]
[{"$nulls":10},{"v":0,"d":"0 "}]
[{"$nulls":10},{"v":0,"d":"0 "}]
[{"$nulls":10},{"v":0,"d":"0 "}]
[{"$nulls":10},{"v":0,"d":"0 "}]
[{"$nulls":10},{"v":0,"d":"0 "}]
[{"$nulls":10},{"v":0,"d":"0 "}]
[{"$nulls":10},{"v":0,"d":"0 "}]
[{"$nulls":10},{"v":0,"d":"0 "}]
[{"$nulls":10},{"v":0,"d":"0 "}]
[{"$nulls":10},{"v":0,"d":"0 "}]
[{"$nulls":10},{"v":0,"d":"0 "}]
[{"$nulls":10},{"v":0,"d":"0 "}]
[{"$nulls":10},{"v":0,"d":"0 "}]
[{"$nulls":10},{"v":0,"d":"0 "}]
[{"$nulls":10},{"v":0,"d":"0 "}]
[{"$nulls":10},{"v":0,"d":"0 "}]
["※は軽減税率対象項目\n０ は非課税、不課税対象項目",{"$nulls":7},"非・不課税 対象小計",null,{"$f":"SUMIF($F$5:$F$26,\"0\",$K$5:$K$26)","v":{"v":0,"d":"0 "}}]
[{"$nulls":8},"8% 対象小計",null,{"$f":"SUMIF($F$5:$F$26,\"※\",$K$5:$K$26)","v":{"v":0,"d":"0 "}}]
["酒井鈴木工業工事担当者",{"$nulls":7},"10% 対象小計",null,{"$f":"SUMIF($F$5:$F$26,\"\",$K$5:$K$26)","v":{"v":0,"d":"0 "}}]
[{"$f":"'内訳欄（１）'!A40","v":0}]
[{"$nulls":7},"　　酒 井 鈴 木 工 業　株 式 会 社"]
[]
["内訳欄（２）－④",{"$nulls":9},{"$f":"$K$1","v":"No. "}]
["工事番号",null,null,{"$f":"D2","v":0},"工事名",null,{"$f":"G2","v":0},{"$nulls":3},"②提出用（経理)"]
[]
["月 日",null,"内　　　　　　　　訳",null,null,"税率\n区分","科目","数　量","単位","単　価","金　　　　額"]
[{"$f":"$A5","v":0},{"$f":"$B5","v":0},{"$f":"C5","v":0},null,null,{"$f":"F5","v":0},{"$f":"$G5","v":0},{"$f":"$H5","v":{"v":0,"d":"0."}},{"$f":"$I5","v":{"v":0,"d":"0."}},{"$f":"$J5","v":{"v":0,"d":"0."}},{"$f":"$K5","v":{"v":0,"d":"0 "}}]
[0,0,0,null,null,0,0,{"v":0,"d":"0."},{"v":0,"d":"0."},{"v":0,"d":"0."},{"v":0,"d":"0 "}]
[0,0,0,null,null,0,0,{"v":0,"d":"0."},{"v":0,"d":"0."},{"v":0,"d":"0."},{"v":0,"d":"0 "}]
[0,0,0,null,null,0,0,{"v":0,"d":"0."},{"v":0,"d":"0."},{"v":0,"d":"0."},{"v":0,"d":"0 "}]
[0,0,0,null,null,0,0,{"v":0,"d":"0."},{"v":0,"d":"0."},{"v":0,"d":"0."},{"v":0,"d":"0 "}]
[0,0,0,null,null,0,0,{"v":0,"d":"0."},{"v":0,"d":"0."},{"v":0,"d":"0."},{"v":0,"d":"0 "}]
[0,0,0,null,null,0,0,{"v":0,"d":"0."},{"v":0,"d":"0."},{"v":0,"d":"0."},{"v":0,"d":"0 "}]
[0,0,0,null,null,0,0,{"v":0,"d":"0."},{"v":0,"d":"0."},{"v":0,"d":"0."},{"v":0,"d":"0 "}]
[0,0,0,null,null,0,0,{"v":0,"d":"0."},{"v":0,"d":"0."},{"v":0,"d":"0."},{"v":0,"d":"0 "}]
[0,0,0,null,null,0,0,{"v":0,"d":"0."},{"v":0,"d":"0."},{"v":0,"d":"0."},{"v":0,"d":"0 "}]
[0,0,0,null,null,0,0,{"v":0,"d":"0."},{"v":0,"d":"0."},{"v":0,"d":"0."},{"v":0,"d":"0 "}]
[0,0,0,null,null,0,0,{"v":0,"d":"0."},{"v":0,"d":"0."},{"v":0,"d":"0."},{"v":0,"d":"0 "}]
[0,0,0,null,null,0,0,{"v":0,"d":"0."},{"v":0,"d":"0."},{"v":0,"d":"0."},{"v":0,"d":"0 "}]
[0,0,0,null,null,0,0,{"v":0,"d":"0."},{"v":0,"d":"0."},{"v":0,"d":"0."},{"v":0,"d":"0 "}]
[0,0,0,null,null,0,0,{"v":0,"d":"0."},{"v":0,"d":"0."},{"v":0,"d":"0."},{"v":0,"d":"0 "}]
[0,0,0,null,null,0,0,{"v":0,"d":"0."},{"v":0,"d":"0."},{"v":0,"d":"0."},{"v":0,"d":"0 "}]
[0,0,0,null,null,0,0,{"v":0,"d":"0."},{"v":0,"d":"0."},{"v":0,"d":"0."},{"v":0,"d":"0 "}]
[0,0,0,null,null,0,0,{"v":0,"d":"0."},{"v":0,"d":"0."},{"v":0,"d":"0."},{"v":0,"d":"0 "}]
[0,0,0,null,null,0,0,{"v":0,"d":"0."},{"v":0,"d":"0."},{"v":0,"d":"0."},{"v":0,"d":"0 "}]
[0,0,0,null,null,0,0,{"v":0,"d":"0."},{"v":0,"d":"0."},{"v":0,"d":"0."},{"v":0,"d":"0 "}]
[0,0,0,null,null,0,0,{"v":0,"d":"0."},{"v":0,"d":"0."},{"v":0,"d":"0."},{"v":0,"d":"0 "}]
[0,0,0,null,null,0,0,{"v":0,"d":"0."},{"v":0,"d":"0."},{"v":0,"d":"0."},{"v":0,"d":"0 "}]
["※は軽減税率対象項目\n０ は非課税、不課税対象項目",{"$nulls":7},"非・不課税 対象小計",null,{"$f":"K27","v":{"v":0,"d":"0 "}}]
[{"$nulls":8},"8% 対象小計",null,{"v":0,"d":"0 "}]
["酒井鈴木工業工事担当者",{"$nulls":7},"10% 対象小計",null,{"v":0,"d":"0 "}]
[{"$f":"A30","v":0}]
[{"$nulls":7},"　　酒 井 鈴 木 工 業　株 式 会 社"]
[]
["内訳欄（２）－④",{"$nulls":9},{"$f":"$K$1","v":"No. "}]
["工事番号",null,null,{"$f":"D2","v":0},"工事名",null,{"$f":"G2","v":0},{"$nulls":3},"③提出用（担当者控）"]
[]
["月 日",null,"内　　　　　　　　訳",null,null,"税率\n区分","科目","数　量","単位","単　価","金　　　　額"]
[{"$f":"$A5","v":0},{"$f":"$B5","v":0},{"$f":"C5","v":0},null,null,{"$f":"F5","v":0},{"$f":"$G5","v":0},{"$f":"$H5","v":{"v":0,"d":"0."}},{"$f":"$I5","v":{"v":0,"d":"0."}},{"$f":"$J5","v":{"v":0,"d":"0."}},{"$f":"$K5","v":{"v":0,"d":"0 "}}]
[0,0,0,null,null,0,0,{"v":0,"d":"0."},{"v":0,"d":"0."},{"v":0,"d":"0."},{"v":0,"d":"0 "}]
[0,0,0,null,null,0,0,{"v":0,"d":"0."},{"v":0,"d":"0."},{"v":0,"d":"0."},{"v":0,"d":"0 "}]
[0,0,0,null,null,0,0,{"v":0,"d":"0."},{"v":0,"d":"0."},{"v":0,"d":"0."},{"v":0,"d":"0 "}]
[0,0,0,null,null,0,0,{"v":0,"d":"0."},{"v":0,"d":"0."},{"v":0,"d":"0."},{"v":0,"d":"0 "}]
[0,0,0,null,null,0,0,{"v":0,"d":"0."},{"v":0,"d":"0."},{"v":0,"d":"0."},{"v":0,"d":"0 "}]
[0,0,0,null,null,0,0,{"v":0,"d":"0."},{"v":0,"d":"0."},{"v":0,"d":"0."},{"v":0,"d":"0 "}]
[0,0,0,null,null,0,0,{"v":0,"d":"0."},{"v":0,"d":"0."},{"v":0,"d":"0."},{"v":0,"d":"0 "}]
[0,0,0,null,null,0,0,{"v":0,"d":"0."},{"v":0,"d":"0."},{"v":0,"d":"0."},{"v":0,"d":"0 "}]
[0,0,0,null,null,0,0,{"v":0,"d":"0."},{"v":0,"d":"0."},{"v":0,"d":"0."},{"v":0,"d":"0 "}]
[0,0,0,null,null,0,0,{"v":0,"d":"0."},{"v":0,"d":"0."},{"v":0,"d":"0."},{"v":0,"d":"0 "}]
[0,0,0,null,null,0,0,{"v":0,"d":"0."},{"v":0,"d":"0."},{"v":0,"d":"0."},{"v":0,"d":"0 "}]
[0,0,0,null,null,0,0,{"v":0,"d":"0."},{"v":0,"d":"0."},{"v":0,"d":"0."},{"v":0,"d":"0 "}]
[0,0,0,null,null,0,0,{"v":0,"d":"0."},{"v":0,"d":"0."},{"v":0,"d":"0."},{"v":0,"d":"0 "}]
[0,0,0,null,null,0,0,{"v":0,"d":"0."},{"v":0,"d":"0."},{"v":0,"d":"0."},{"v":0,"d":"0 "}]
[0,0,0,null,null,0,0,{"v":0,"d":"0."},{"v":0,"d":"0."},{"v":0,"d":"0."},{"v":0,"d":"0 "}]
[0,0,0,null,null,0,0,{"v":0,"d":"0."},{"v":0,"d":"0."},{"v":0,"d":"0."},{"v":0,"d":"0 "}]
[0,0,0,null,null,0,0,{"v":0,"d":"0."},{"v":0,"d":"0."},{"v":0,"d":"0."},{"v":0,"d":"0 "}]
[0,0,0,null,null,0,0,{"v":0,"d":"0."},{"v":0,"d":"0."},{"v":0,"d":"0."},{"v":0,"d":"0 "}]
[0,0,0,null,null,0,0,{"v":0,"d":"0."},{"v":0,"d":"0."},{"v":0,"d":"0."},{"v":0,"d":"0 "}]
[0,0,0,null,null,0,0,{"v":0,"d":"0."},{"v":0,"d":"0."},{"v":0,"d":"0."},{"v":0,"d":"0 "}]
[0,0,0,null,null,0,0,{"v":0,"d":"0."},{"v":0,"d":"0."},{"v":0,"d":"0."},{"v":0,"d":"0 "}]
["※は軽減税率対象項目\n０ は非課税、不課税対象項目",{"$nulls":5},{"$f":"$G27","v":0},{"$f":"$H27","v":{"v":0,"d":"0."}},"非・不課税 対象小計",null,{"$f":"K27","v":{"v":0,"d":"0 "}}]
[{"$nulls":8},"8% 対象小計",null,{"v":0,"d":"0 "}]
["酒井鈴木工業工事担当者",{"$nulls":7},"10% 対象小計",null,{"v":0,"d":"0 "}]
[{"$f":"A30","v":0}]
[{"$nulls":7},"　　酒 井 鈴 木 工 業　株 式 会 社"]

{"sheet":"内訳欄（２）-5","index":5,"n_rows":95,"n_cols":11,"rows_kept":95,"merged":[[1,0,1,2],[1,4,1,5],[1,6,1,9],[3,0,3,1],[3,2,3,4],[4,2,4,4],[5,2,5,4],[6,2,6,4],[7,2,7,4],[8,2,8,4],[9,2,9,4],[10,2,10,4],[11,2,11,4],[12,2,12,4],[13,2,13,4],[14,2,14,4],[15,2,15,4],[16,2,16,4],[17,2,17,4],[18,2,18,4],[19,2,19,4],[20,2,20,4],[21,2,21,4],[22,2,22,4],[23,2,23,4],[24,2,24,4],[25,2,25,4],[26,0,26,4],[26,8,26,9],[27,8,27,9],[28,0,28,3],[28,8,28,9],[29,0,30,3],[30,7,30,10],[33,0,33,2],[33,4,33,5],[33,6,33,9],[35,0,35,1],[35,2,35,4],[36,2,36,4],[37,2,37,4],[38,2,38,4],[39,2,39,4],[40,2,40,4],[41,2,41,4],[42,2,42,4],[43,2,43,4],[44,2,44,4],[45,2,45,4],[46,2,46,4],[47,2,47,4],[48,2,48,4],[49,2,49,4],[50,2,50,4],[51,2,51,4],[52,2,52,4],[53,2,53,4],[54,2,54,4],[55,2,55,4],[56,2,56,4],[57,2,57,4],[58,0,58,4],[58,8,58,9],[59,8,59,9],[60,0,60,3],[60,8,60,9],[61,0,62,3],[62,7,62,10],[65,0,65,2],[65,4,65,5],[65,6,65,9],[67,0,67,1],[67,2,67,4],[68,2,68,4],[69,2,69,4],[70,2,70,4],[71,2,71,4],[72,2,72,4],[73,2,73,4],[74,2,74,4],[75,2,75,4],[76,2,76,4],[77,2,77,4],[78,2,78,4],[79,2,79,4],[80,2,80,4],[81,2,81,4],[82,2,82,4],[83,2,83,4],[84,2,84,4],[85,2,85,4],[86,2,86,4],[87,2,87,4],[88,2,88,4],[89,2,89,4],[90,0,90,4],[90,8,90,9],[91,8,91,9],[92,0,92,3],[92,8,92,9],[93,0,94,3],[94,7,94,10]]}
["内訳欄（２）－⑤",{"$nulls":9},{"$f":"IF('内訳欄（１）'!CH1=\"\",\"No. \",\"No. \"&TEXT('内訳欄（１）'!CH1,0))","v":"No. "}]
["工事番号",null,null,{"$f":"'内訳欄（１）'!$Q$10","v":0},"工事名",null,{"$f":"'内訳欄（１）'!$AU$10","v":0},{"$nulls":3},"①取引先控"]
[]
["月 日",null,"内　　　　　　　　訳",null,null,"税率\n区分","科目","数　量","単位","単　価","金　　　　額"]
[{"$nulls":10},{"$f":"ROUND(H5*J5,0)","v":{"v":0,"d":"0 "}}]
[{"$nulls":10},{"$f":"ROUND(H6*J6,0)","v":{"v":0,"d":"0 "}}]
[{"$nulls":10},{"v":0,"d":"0 "}]
[{"$nulls":10},{"v":0,"d":"0 "}]
[{"$nulls":10},{"v":0,"d":"0 "}]
[{"$nulls":10},{"v":0,"d":"0 "}]
[{"$nulls":10},{"v":0,"d":"0 "}]
[{"$nulls":10},{"v":0,"d":"0 "}]
[{"$nulls":10},{"v":0,"d":"0 "}]
[{"$nulls":10},{"v":0,"d":"0 "}]
[{"$nulls":10},{"v":0,"d":"0 "}]
[{"$nulls":10},{"v":0,"d":"0 "}]
[{"$nulls":10},{"v":0,"d":"0 "}]
[{"$nulls":10},{"v":0,"d":"0 "}]
[{"$nulls":10},{"v":0,"d":"0 "}]
[{"$nulls":10},{"v":0,"d":"0 "}]
[{"$nulls":10},{"v":0,"d":"0 "}]
[{"$nulls":10},{"v":0,"d":"0 "}]
[{"$nulls":10},{"v":0,"d":"0 "}]
[{"$nulls":10},{"v":0,"d":"0 "}]
[{"$nulls":10},{"v":0,"d":"0 "}]
[{"$nulls":10},{"v":0,"d":"0 "}]
["※は軽減税率対象項目\n０ は非課税、不課税対象項目",{"$nulls":7},"非・不課税 対象小計",null,{"$f":"SUMIF($F$5:$F$26,\"0\",$K$5:$K$26)","v":{"v":0,"d":"0 "}}]
[{"$nulls":8},"8% 対象小計",null,{"$f":"SUMIF($F$5:$F$26,\"※\",$K$5:$K$26)","v":{"v":0,"d":"0 "}}]
["酒井鈴木工業工事担当者",{"$nulls":7},"10% 対象小計",null,{"$f":"SUMIF($F$5:$F$26,\"\",$K$5:$K$26)","v":{"v":0,"d":"0 "}}]
[{"$f":"'内訳欄（１）'!A40","v":0}]
[{"$nulls":7},"　　酒 井 鈴 木 工 業　株 式 会 社"]
[]
["内訳欄（２）－⑤",{"$nulls":9},{"$f":"$K$1","v":"No. "}]
["工事番号",null,null,{"$f":"D2","v":0},"工事名",null,{"$f":"G2","v":0},{"$nulls":3},"②提出用（経理)"]
[]
["月 日",null,"内　　　　　　　　訳",null,null,"税率\n区分","科目","数　量","単位","単　価","金　　　　額"]
[{"$f":"$A5","v":0},{"$f":"$B5","v":0},{"$f":"C5","v":0},null,null,{"$f":"F5","v":0},{"$f":"$G5","v":0},{"$f":"$H5","v":{"v":0,"d":"0."}},{"$f":"$I5","v":{"v":0,"d":"0."}},{"$f":"$J5","v":{"v":0,"d":"0."}},{"$f":"$K5","v":{"v":0,"d":"0 "}}]
[0,0,0,null,null,0,0,{"v":0,"d":"0."},{"v":0,"d":"0."},{"v":0,"d":"0."},{"v":0,"d":"0 "}]
[0,0,0,null,null,0,0,{"v":0,"d":"0."},{"v":0,"d":"0."},{"v":0,"d":"0."},{"v":0,"d":"0 "}]
[0,0,0,null,null,0,0,{"v":0,"d":"0."},{"v":0,"d":"0."},{"v":0,"d":"0."},{"v":0,"d":"0 "}]
[0,0,0,null,null,0,0,{"v":0,"d":"0."},{"v":0,"d":"0."},{"v":0,"d":"0."},{"v":0,"d":"0 "}]
[0,0,0,null,null,0,0,{"v":0,"d":"0."},{"v":0,"d":"0."},{"v":0,"d":"0."},{"v":0,"d":"0 "}]
[0,0,0,null,null,0,0,{"v":0,"d":"0."},{"v":0,"d":"0."},{"v":0,"d":"0."},{"v":0,"d":"0 "}]
[0,0,0,null,null,0,0,{"v":0,"d":"0."},{"v":0,"d":"0."},{"v":0,"d":"0."},{"v":0,"d":"0 "}]
[0,0,0,null,null,0,0,{"v":0,"d":"0."},{"v":0,"d":"0."},{"v":0,"d":"0."},{"v":0,"d":"0 "}]
[0,0,0,null,null,0,0,{"v":0,"d":"0."},{"v":0,"d":"0."},{"v":0,"d":"0."},{"v":0,"d":"0 "}]
[0,0,0,null,null,0,0,{"v":0,"d":"0."},{"v":0,"d":"0."},{"v":0,"d":"0."},{"v":0,"d":"0 "}]
[0,0,0,null,null,0,0,{"v":0,"d":"0."},{"v":0,"d":"0."},{"v":0,"d":"0."},{"v":0,"d":"0 "}]
[0,0,0,null,null,0,0,{"v":0,"d":"0."},{"v":0,"d":"0."},{"v":0,"d":"0."},{"v":0,"d":"0 "}]
[0,0,0,null,null,0,0,{"v":0,"d":"0."},{"v":0,"d":"0."},{"v":0,"d":"0."},{"v":0,"d":"0 "}]
[0,0,0,null,null,0,0,{"v":0,"d":"0."},{"v":0,"d":"0."},{"v":0,"d":"0."},{"v":0,"d":"0 "}]
[0,0,0,null,null,0,0,{"v":0,"d":"0."},{"v":0,"d":"0."},{"v":0,"d":"0."},{"v":0,"d":"0 "}]
[0,0,0,null,null,0,0,{"v":0,"d":"0."},{"v":0,"d":"0."},{"v":0,"d":"0."},{"v":0,"d":"0 "}]
[0,0,0,null,null,0,0,{"v":0,"d":"0."},{"v":0,"d":"0."},{"v":0,"d":"0."},{"v":0,"d":"0 "}]
[0,0,0,null,null,0,0,{"v":0,"d":"0."},{"v":0,"d":"0."},{"v":0,"d":"0."},{"v":0,"d":"0 "}]
[0,0,0,null,null,0,0,{"v":0,"d":"0."},{"v":0,"d":"0."},{"v":0,"d":"0."},{"v":0,"d":"0 "}]
[0,0,0,null,null,0,0,{"v":0,"d":"0."},{"v":0,"d":"0."},{"v":0,"d":"0."},{"v":0,"d":"0 "}]
[0,0,0,null,null,0,0,{"v":0,"d":"0."},{"v":0,"d":"0."},{"v":0,"d":"0."},{"v":0,"d":"0 "}]
["※は軽減税率対象項目\n０ は非課税、不課税対象項目",{"$nulls":7},"非・不課税 対象小計",null,{"$f":"K27","v":{"v":0,"d":"0 "}}]
[{"$nulls":8},"8% 対象小計",null,{"v":0,"d":"0 "}]
["酒井鈴木工業工事担当者",{"$nulls":7},"10% 対象小計",null,{"v":0,"d":"0 "}]
[{"$f":"A30","v":0}]
[{"$nulls":7},"　　酒 井 鈴 木 工 業　株 式 会 社"]
[]
["内訳欄（２）－⑤",{"$nulls":9},{"$f":"$K$1","v":"No. "}]
["工事番号",null,null,{"$f":"D2","v":0},"工事名",null,{"$f":"G2","v":0},{"$nulls":3},"③提出用（担当者控）"]
[]
["月 日",null,"内　　　　　　　　訳",null,null,"税率\n区分","科目","数　量","単位","単　価","金　　　　額"]
[{"$f":"$A5","v":0},{"$f":"$B5","v":0},{"$f":"C5","v":0},null,null,{"$f":"F5","v":0},{"$f":"$G5","v":0},{"$f":"$H5","v":{"v":0,"d":"0."}},{"$f":"$I5","v":{"v":0,"d":"0."}},{"$f":"$J5","v":{"v":0,"d":"0."}},{"$f":"$K5","v":{"v":0,"d":"0 "}}]
[0,0,0,null,null,0,0,{"v":0,"d":"0."},{"v":0,"d":"0."},{"v":0,"d":"0."},{"v":0,"d":"0 "}]
[0,0,0,null,null,0,0,{"v":0,"d":"0."},{"v":0,"d":"0."},{"v":0,"d":"0."},{"v":0,"d":"0 "}]
[0,0,0,null,null,0,0,{"v":0,"d":"0."},{"v":0,"d":"0."},{"v":0,"d":"0."},{"v":0,"d":"0 "}]
[0,0,0,null,null,0,0,{"v":0,"d":"0."},{"v":0,"d":"0."},{"v":0,"d":"0."},{"v":0,"d":"0 "}]
[0,0,0,null,null,0,0,{"v":0,"d":"0."},{"v":0,"d":"0."},{"v":0,"d":"0."},{"v":0,"d":"0 "}]
[0,0,0,null,null,0,0,{"v":0,"d":"0."},{"v":0,"d":"0."},{"v":0,"d":"0."},{"v":0,"d":"0 "}]
[0,0,0,null,null,0,0,{"v":0,"d":"0."},{"v":0,"d":"0."},{"v":0,"d":"0."},{"v":0,"d":"0 "}]
[0,0,0,null,null,0,0,{"v":0,"d":"0."},{"v":0,"d":"0."},{"v":0,"d":"0."},{"v":0,"d":"0 "}]
[0,0,0,null,null,0,0,{"v":0,"d":"0."},{"v":0,"d":"0."},{"v":0,"d":"0."},{"v":0,"d":"0 "}]
[0,0,0,null,null,0,0,{"v":0,"d":"0."},{"v":0,"d":"0."},{"v":0,"d":"0."},{"v":0,"d":"0 "}]
[0,0,0,null,null,0,0,{"v":0,"d":"0."},{"v":0,"d":"0."},{"v":0,"d":"0."},{"v":0,"d":"0 "}]
[0,0,0,null,null,0,0,{"v":0,"d":"0."},{"v":0,"d":"0."},{"v":0,"d":"0."},{"v":0,"d":"0 "}]
[0,0,0,null,null,0,0,{"v":0,"d":"0."},{"v":0,"d":"0."},{"v":0,"d":"0."},{"v":0,"d":"0 "}]
[0,0,0,null,null,0,0,{"v":0,"d":"0."},{"v":0,"d":"0."},{"v":0,"d":"0."},{"v":0,"d":"0 "}]
[0,0,0,null,null,0,0,{"v":0,"d":"0."},{"v":0,"d":"0."},{"v":0,"d":"0."},{"v":0,"d":"0 "}]
[0,0,0,null,null,0,0,{"v":0,"d":"0."},{"v":0,"d":"0."},{"v":0,"d":"0."},{"v":0,"d":"0 "}]
[0,0,0,null,null,0,0,{"v":0,"d":"0."},{"v":0,"d":"0."},{"v":0,"d":"0."},{"v":0,"d":"0 "}]
[0,0,0,null,null,0,0,{"v":0,"d":"0."},{"v":0,"d":"0."},{"v":0,"d":"0."},{"v":0,"d":"0 "}]
[0,0,0,null,null,0,0,{"v":0,"d":"0."},{"v":0,"d":"0."},{"v":0,"d":"0."},{"v":0,"d":"0 "}]
[0,0,0,null,null,0,0,{"v":0,"d":"0."},{"v":0,"d":"0."},{"v":0,"d":"0."},{"v":0,"d":"0 "}]
[0,0,0,null,null,0,0,{"v":0,"d":"0."},{"v":0,"d":"0."},{"v":0,"d":"0."},{"v":0,"d":"0 "}]
["※は軽減税率対象項目\n０ は非課税、不課税対象項目",{"$nulls":7},"非・不課税 対象小計",null,{"$f":"K27","v":{"v":0,"d":"0 "}}]
[{"$nulls":8},"8% 対象小計",null,{"v":0,"d":"0 "}]
["酒井鈴木工業工事担当者",{"$nulls":7},"10% 対象小計",null,{"v":0,"d":"0 "}]
[{"$f":"A30","v":0}]
[{"$nulls":7},"　　酒 井 鈴 木 工 業　株 式 会 社"]

{"sheet":"リスト","index":6,"n_rows":13,"n_cols":19,"rows_kept":13,"hidden":true}
["月","日","金融機関","支店","数字","口座種目","1月","2月","3月","4月","5月","6月","7月","8月","9月","10月","11月","12月","税率"]
[1,20,"金融機関","支店",0,"普通／当座",20,20,20,20,20,20,20,20,20,20,20,15,"※"]
[2,null,"銀行","本店",1,"普通",{"$nulls":5},30,{"$nulls":5},20,"0"]
[3,null,"信金","営業部",2,"当座"]
[4,null,"農協","出張所",3]
[5,null,"郵貯",null,4]
[6,null,"その他",null,5]
[7,{"$nulls":3},6]
[8,{"$nulls":3},7]
[9,{"$nulls":3},8]
[10,{"$nulls":3},9]
[11]
[12]